Aluminum chloride fluoride

Gas phase thermochemistry data

Quantity Value Units Method Reference Comment
Δfgas-790.78kJ/molReviewChase, 1998Data last reviewed in June, 1976
Quantity Value Units Method Reference Comment
gas,1 bar311.31J/mol*KReviewChase, 1998Data last reviewed in June, 1976

Gas Phase Heat Capacity (Shomate Equation)

Cp° = A + B*t + C*t2 + D*t3 + E/t2
H° − H°298.15= A*t + B*t2/2 + C*t3/3 + D*t4/4 − E/t + F − H
S° = A*ln(t) + B*t + C*t2/2 + D*t3/3 − E/(2*t2) + G
    Cp = heat capacity (J/mol*K)
    H° = standard enthalpy (kJ/mol)
    S° = standard entropy (J/mol*K)
    t = temperature (K) / 1000.

View plot Requires a JavaScript / HTML 5 canvas capable browser.

View table.

Temperature (K) 298. - 6000.
A 80.20268
B 2.475239
C -0.665394
D 0.056499
E -1.111870
F -818.5201
G 401.4029
H -790.7760
ReferenceChase, 1998
Comment Data last reviewed in June, 1976

Reaction thermochemistry data

Data compiled by: John E. Bartmess

Individual Reactions

Chlorine anion + Aluminum chloride fluoride = (Chlorine anion • Aluminum chloride fluoride)

By formula: Cl- + AlCl2F = (Cl- • AlCl2F)

Quantity Value Units Method Reference Comment
Δr315. ± 12.kJ/molTDAsPervova, Korobov, et al., 1992gas phase; Thermo at 0K, experiemnts at 800-1100K. See also AlCl3..F-; value altered from reference due to conversion from electron convention to ion convention

Fluorine anion + Aluminum chloride fluoride = (Fluorine anion • Aluminum chloride fluoride)

By formula: F- + AlCl2F = (F- • AlCl2F)

Quantity Value Units Method Reference Comment
Δr499. ± 12.kJ/molTDAsPervova, Korobov, et al., 1992gas phase; Thermo at 0K, experiments at 800-1100 K; value altered from reference due to conversion from electron convention to ion convention

Ion clustering data

Data compiled by: John E. Bartmess

Clustering reactions

Chlorine anion + Aluminum chloride fluoride = (Chlorine anion • Aluminum chloride fluoride)

By formula: Cl- + AlCl2F = (Cl- • AlCl2F)

Quantity Value Units Method Reference Comment
Δr315. ± 12.kJ/molTDAsPervova, Korobov, et al., 1992gas phase; Thermo at 0K, experiemnts at 800-1100K. See also AlCl3..F-; value altered from reference due to conversion from electron convention to ion convention

Fluorine anion + Aluminum chloride fluoride = (Fluorine anion • Aluminum chloride fluoride)

By formula: F- + AlCl2F = (F- • AlCl2F)

Quantity Value Units Method Reference Comment
Δr499. ± 12.kJ/molTDAsPervova, Korobov, et al., 1992gas phase; Thermo at 0K, experiments at 800-1100 K; value altered from reference due to conversion from electron convention to ion convention

References

Chase, 1998
Chase, M.W., Jr., NIST-JANAF Themochemical Tables, Fourth Edition, J. Phys. Chem. Ref. Data, Monograph 9, 1998, 1-1951. [all data]

Pervova, Korobov, et al., 1992
Pervova, Y.U.; Korobov, M.V.; Sidorov, L.N., Enthalpies of Bonds Rupture in AlClnF4-n(-) Anions, Russ. J. Phys. Chem., 1992, 66, 635. [all data]