2-Phenyl-3-benzoylquinoxaline-1,4-dioxide

Gas phase thermochemistry data

Data compiled by: Hussein Y. Afeefy, Joel F. Liebman, and Stephen E. Stein

Quantity Value Units Method Reference Comment
Δfgas84.9 ± 1.7kcal/molCcbAcree, Powell, et al., 1997

Condensed phase thermochemistry data

Data compiled by: Hussein Y. Afeefy, Joel F. Liebman, and Stephen E. Stein

Quantity Value Units Method Reference Comment
Δfsolid44.9 ± 1.4kcal/molCcbAcree, Powell, et al., 1997
Quantity Value Units Method Reference Comment
Δcsolid-2498.2 ± 1.2kcal/molCcbAcree, Powell, et al., 1997

Phase change data

Data compiled as indicated in comments:
ALS - Hussein Y. Afeefy, Joel F. Liebman, and Stephen E. Stein
AC - William E. Acree, Jr., James S. Chickos

Quantity Value Units Method Reference Comment
Δsub40.01 ± 0.96kcal/molCAcree, Powell, et al., 1997ALS
Δsub40.01 ± 0.96kcal/molMEAcree, Powell, et al., 1997AC

References

Acree, Powell, et al., 1997
Acree, W.E., Jr.; Powell, J.R.; Tucker, S.A.; Ribeiro da Silva, M.D.M.C.; Matos, M.A.R.; Goncalves, J.M.; Santos, L.M.N.B.F.; Morais, V.M.F.; Pilcher, G., Thermochemical and theroretical study of some quinoxaline 1,4-dioxides and pyrazine 1,4-dioxide, J. Org. Chem., 1997, 62, 3722-3726. [all data]