dichlorohexylaluminium

Condensed phase thermochemistry data

Data compiled by: José A. Martinho Simões

Quantity Value Units Method Reference Comment
Δfliquid-287.8 ± 2.4kJ/molReviewMartinho Simões
Quantity Value Units Method Reference Comment
Δcliquid-4817.5 ± 2.1kJ/molCC-SBPawlenko, 1969The enthalpy of combustion was corrected according to the method used in Pawlenko, 1969.

References

Martinho Simões
Martinho Simões, J.A., Private communication (see http://webbook.nist.gov/chemistry/om/). [all data]

Pawlenko, 1969
Pawlenko, S., Chem. Ber., 1969, 102, 1937. [all data]