C84

Gas phase ion energetics data

Data compiled by: John E. Bartmess

Electron affinity determinations

EA (eV) Method Reference Comment
3.260 ± 0.020LPESWang, Woo, et al., 2007D2d isomer
3.185 ± 0.010LPESWang, Woo, et al., 2007D2 isomer
3.050 ± 0.080IMREBoltalina, Sidorov, et al., 1993
<3.30 ± 0.20LPESYang, Pettiette, et al., 1987Threshold from graph. Onset based on analogy with Cu cluster data.

References

Wang, Woo, et al., 2007
Wang, X.B.; Woo, H.K.; Yang, J.; Kappes, M.M.; Wang, L.S., Photoelectron spectroscopy of singly and doubly charged higher fullerenes at low temperatures: C-76(-), C-78(-), C-84(-) and C-76(2-), C-78(2-), C-84(2-), J. Phys. Chem. C, 2007, 111, 48, 17684-17689, https://doi.org/10.1021/jp0703861 . [all data]

Boltalina, Sidorov, et al., 1993
Boltalina, O.V.; Sidorov, L.N.; Borshchevsky, A.Y.; Sukhanova, E.V.; Skokan, E.V., Electron Affinities of Higher Fullerenes, Rapid Commun. Mass Spectrom., 1993, 7, 11, 1009, https://doi.org/10.1002/rcm.1290071109 . [all data]

Yang, Pettiette, et al., 1987
Yang, S.H.; Pettiette, C.L.; Conceicao, J.; Cheshnovsky, O.; Smalley, R.E., UPS of Buckminsterfullerene and other Large Clusters of Carbon, Chem. Phys. Lett., 1987, 139, 3-4, 233, https://doi.org/10.1016/0009-2614(87)80548-1 . [all data]