Phosphinic chloride, bis(chloromethyl)-

Gas phase ion energetics data

Data compiled by: Sharon G. Lias, Rhoda D. Levin, and Sherif A. Kafafi

Ionization energy determinations

IE (eV) Method Reference
10.46PEZverev, Vilesov, et al., 1975

References

Zverev, Vilesov, et al., 1975
Zverev, V.V.; Vilesov, F.I.; Vovna, V.I.; Lopatin, S.N.; Kitaev, Y.P., Photoelectron spectra, Izv. Akad. Nauk SSSR, Ser. Khim., 1975, 1975, 1051. [all data]