HOSbO2

Vibrational and/or electronic energy levels

Data compiled by: Marilyn E. Jacox

State:   X

Vib.
sym.
 No.   Approximate
 type of mode
 cm-1   Med.   Method   References

OH stretch 3604 Ar IR Andrews, Moores, et al., 1989
SbO stretch 635 Ar IR Andrews, Moores, et al., 1989
Torsion 370 Ar IR Andrews, Moores, et al., 1989

Additional references: Jacox, 1994, page 274

References

Andrews, Moores, et al., 1989
Andrews, L.; Moores, B.W.; Fonda, K.K., Matrix infrared spectra of reaction and photolysis products of stibine and ozone, Inorg. Chem., 1989, 28, 2, 290, https://doi.org/10.1021/ic00301a028 . [all data]

Jacox, 1994
Jacox, M.E., Vibrational and electronic energy levels of polyatomic transient molecules, American Chemical Society, Washington, DC, 1994, 464. [all data]