Tungsten tetrachloride

Condensed phase thermochemistry data

Quantity Value Units Method Reference Comment
Δfsolid-105.90kcal/molReviewChase, 1998Data last reviewed in December, 1966
Quantity Value Units Method Reference Comment
solid47.435cal/mol*KReviewChase, 1998Data last reviewed in December, 1966

Solid Phase Heat Capacity (Shomate Equation)

Cp° = A + B*t + C*t2 + D*t3 + E/t2
H° − H°298.15= A*t + B*t2/2 + C*t3/3 + D*t4/4 − E/t + F − H
S° = A*ln(t) + B*t + C*t2/2 + D*t3/3 − E/(2*t2) + G
    Cp = heat capacity (cal/mol*K)
    H° = standard enthalpy (kcal/mol)
    S° = standard entropy (cal/mol*K)
    t = temperature (K) / 1000.

View plot Requires a JavaScript / HTML 5 canvas capable browser.

View table.

Temperature (K) 298. - 2000.
A 20.69340
B 30.25559
C -13.64630
D 2.298011
E 0.220996
F -112.5470
G 65.28750
H -105.9000
ReferenceChase, 1998
Comment Data last reviewed in December, 1966

References

Chase, 1998
Chase, M.W., Jr., NIST-JANAF Themochemical Tables, Fourth Edition, J. Phys. Chem. Ref. Data, Monograph 9, 1998, 1-1951. [all data]