Triiodosilane

Gas phase thermochemistry data

Quantity Value Units Method Reference Comment
Δfgas-17.80kcal/molReviewChase, 1998Data last reviewed in December, 1976
Quantity Value Units Method Reference Comment
gas,1 bar89.630cal/mol*KReviewChase, 1998Data last reviewed in December, 1976

Gas Phase Heat Capacity (Shomate Equation)

Cp° = A + B*t + C*t2 + D*t3 + E/t2
H° − H°298.15= A*t + B*t2/2 + C*t3/3 + D*t4/4 − E/t + F − H
S° = A*ln(t) + B*t + C*t2/2 + D*t3/3 − E/(2*t2) + G
    Cp = heat capacity (cal/mol*K)
    H° = standard enthalpy (kcal/mol)
    S° = standard entropy (cal/mol*K)
    t = temperature (K) / 1000.

View plot Requires a JavaScript / HTML 5 canvas capable browser.

View table.

Temperature (K) 298. - 1200.1200. - 6000.
A 19.4469025.26941
B 9.5579710.299432
C -6.037701-0.058314
D 1.4757110.003922
E -0.155802-1.291271
F -24.49529-28.44391
G 109.6920115.8880
H -17.80000-17.80000
ReferenceChase, 1998Chase, 1998
Comment Data last reviewed in December, 1976 Data last reviewed in December, 1976

Reaction thermochemistry data

Data compiled by: John E. Bartmess

Individual Reactions

I3Sn- + Hydrogen cation = Triiodosilane

By formula: I3Sn- + H+ = HI3Si

Quantity Value Units Method Reference Comment
Δr274.60kcal/molN/ACheck, Faust, et al., 2001gas phase; NiO2-(q); ; ΔS(EA)=5.0
Quantity Value Units Method Reference Comment
Δr269.70kcal/molN/ACheck, Faust, et al., 2001gas phase; NiO2-(q); ; ΔS(EA)=5.0

Gas phase ion energetics data

Data compiled by: John E. Bartmess

De-protonation reactions

I3Sn- + Hydrogen cation = Triiodosilane

By formula: I3Sn- + H+ = HI3Si

Quantity Value Units Method Reference Comment
Δr274.60kcal/molN/ACheck, Faust, et al., 2001gas phase; NiO2-(q); ; ΔS(EA)=5.0
Quantity Value Units Method Reference Comment
Δr269.70kcal/molN/ACheck, Faust, et al., 2001gas phase; NiO2-(q); ; ΔS(EA)=5.0

References

Chase, 1998
Chase, M.W., Jr., NIST-JANAF Themochemical Tables, Fourth Edition, J. Phys. Chem. Ref. Data, Monograph 9, 1998, 1-1951. [all data]

Check, Faust, et al., 2001
Check, C.E.; Faust, T.O.; Bailey, J.M.; Wright, B.J.; Gilbert, T.M.; Sunderlin, L.S., Addition of Polarization and Diffuse Functions to the LANL2DZ Basis Set for P-Block Elements, J. Phys. Chem. A,, 2001, 105, 34, 8111, https://doi.org/10.1021/jp011945l . [all data]