selenium tetrafluoride

Phase change data

Data compiled as indicated in comments:
BS - Robert L. Brown and Stephen E. Stein
AC - William E. Acree, Jr., James S. Chickos

Quantity Value Units Method Reference Comment
Tboil374.KN/APCR Inc., 1990BS

Enthalpy of vaporization

ΔvapH (kJ/mol) Temperature (K) Reference Comment
46.4312.Dykyj, Svoboda, et al., 1999Based on data from 297. - 398. K.; AC

Gas phase ion energetics data

Data compiled by: John E. Bartmess

Electron affinity determinations

EA (eV) Method Reference Comment
1.70 ± 0.10EIAEHarland and Thynne, 1973From SeF6; G2MP2 calculations indicate an EA of ca. 2.0 eV

References

PCR Inc., 1990
PCR Inc., Research Chemicals Catalog 1990-1991, PCR Inc., Gainesville, FL, 1990, 1. [all data]

Dykyj, Svoboda, et al., 1999
Dykyj, J.; Svoboda, J.; Wilhoit, R.C.; Frenkel, M.L.; Hall, K.R., Vapor Pressure of Chemicals: Part A. Vapor Pressure and Antoine Constants for Hydrocarbons and Sulfur, Selenium, Tellurium and Hydrogen Containing Organic Compounds, Springer, Berlin, 1999, 373. [all data]