1,1-diphenylhexadecane

Phase change data

Data compiled by: Thermodynamics Research Center, NIST Boulder Laboratories, Chris Muzny director

Quantity Value Units Method Reference Comment
Tfus299.KN/AWibaut, Overhoff, et al., 1943Uncertainty assigned by TRC = 3. K; capillary tube melting point,
Tfus294.4KN/AWibaut, Overhoff, et al., 1943Uncertainty assigned by TRC = 3. K; solidification point
Tfus299.KN/ASchmidt and Hartmann, 1941Uncertainty assigned by TRC = 3. K

In addition to the Thermodynamics Research Center (TRC) data available from this site, much more physical and chemical property data is available from the following TRC products:

References

Wibaut, Overhoff, et al., 1943
Wibaut, J.P.; Overhoff, J.; Jonker, E.W., On the Preparation of Some Hydrocarbons of the Mixed Aliphatic-Aromatic and Aliphatic-Alicyclic Type Containing 22 to 30 C-atoms, Recl. Trav. Chim. Pays-Bas, 1943, 62, 31. [all data]

Schmidt and Hartmann, 1941
Schmidt, A.W.; Hartmann, C., Chem. Ber., 1941, 74, 1325. [all data]