Platinum tetrafluoride

Gas phase ion energetics data

Data compiled as indicated in comments:
LBLHLM - Sharon G. Lias, John E. Bartmess, Joel F. Liebman, John L. Holmes, Rhoda D. Levin, and W. Gary Mallard
B - John E. Bartmess

Electron affinity determinations

EA (eV) Method Reference Comment
5.20 ± 0.16TDEqKorobov, Chilingarov, et al., 1984EA: 0.03 eV > MnF4; B

Ionization energy determinations

IE (eV) Method Reference Comment
12.83 ± 0.28EIKorobov, Bondarenko, et al., 1983LBLHLM

Appearance energy determinations

Ion AE (eV) Other Products MethodReferenceComment
F3Pt+13.3 ± 0.3FEIKorobov, Bondarenko, et al., 1983LBLHLM

References

Korobov, Chilingarov, et al., 1984
Korobov, M.V.; Chilingarov, N.S.; Igolkina, N.A.; Nikitin, M.I.; Sidorov, L.N., Molecules with a high electron affinity. Negative ions in the saturated vapor of the platinum-manganese trifluoride system, Russ. J. Phys. Chem., 1984, 58, 1368. [all data]

Korobov, Bondarenko, et al., 1983
Korobov, M.V.; Bondarenko, A.A.; Sidorov, L.N.; Nikulin, V.V., Enthalpies of formation of the gaseous platinum fluorides, PtF2 and PtF4, High Temp. Sci., 1983, 16, 411. [all data]