lithium metaborate

Gas phase ion energetics data

Data compiled by: Sharon G. Lias, John E. Bartmess, Joel F. Liebman, John L. Holmes, Rhoda D. Levin, and W. Gary Mallard

Ionization energy determinations

IE (eV) Method Reference
9.8 ± 0.5EINeubert, 1985

Appearance energy determinations

Ion AE (eV) Other Products MethodReferenceComment
BO+13.8 ± 0.5LiOEINeubert, 1985

Gas phase thermochemistry data

Quantity Value Units Method Reference Comment
Δfgas-154.60kcal/molReviewChase, 1998Data last reviewed in June, 1971
Quantity Value Units Method Reference Comment
gas,1 bar65.662cal/mol*KReviewChase, 1998Data last reviewed in June, 1971

Gas Phase Heat Capacity (Shomate Equation)

Cp° = A + B*t + C*t2 + D*t3 + E/t2
H° − H°298.15= A*t + B*t2/2 + C*t3/3 + D*t4/4 − E/t + F − H
S° = A*ln(t) + B*t + C*t2/2 + D*t3/3 − E/(2*t2) + G
    Cp = heat capacity (cal/mol*K)
    H° = standard enthalpy (kcal/mol)
    S° = standard entropy (cal/mol*K)
    t = temperature (K) / 1000.

View plot Requires a JavaScript / HTML 5 canvas capable browser.

View table.

Temperature (K) 3000. - 6000.
A 19.42780
B 0.237127
C -0.046347
D 0.003124
E -1.399420
F -163.8390
G 84.35490
H -154.6000
ReferenceChase, 1998
Comment Data last reviewed in June, 1971

Condensed phase thermochemistry data

Quantity Value Units Method Reference Comment
Δfliquid-239.068kcal/molReviewChase, 1998Data last reviewed in June, 1971
Quantity Value Units Method Reference Comment
liquid,1 bar15.67cal/mol*KReviewChase, 1998Data last reviewed in June, 1971
Quantity Value Units Method Reference Comment
Δfsolid-243.599kcal/molReviewChase, 1998Data last reviewed in June, 1971
Quantity Value Units Method Reference Comment
solid12.37cal/mol*KReviewChase, 1998Data last reviewed in June, 1971

Liquid Phase Heat Capacity (Shomate Equation)

Cp° = A + B*t + C*t2 + D*t3 + E/t2
H° − H°298.15= A*t + B*t2/2 + C*t3/3 + D*t4/4 − E/t + F − H
S° = A*ln(t) + B*t + C*t2/2 + D*t3/3 − E/(2*t2) + G
    Cp = heat capacity (cal/mol*K)
    H° = standard enthalpy (kcal/mol)
    S° = standard entropy (cal/mol*K)
    t = temperature (K) / 1000.

View plot Requires a JavaScript / HTML 5 canvas capable browser.

View table.

Temperature (K) 1117. - 3000.
A 34.49099
B -2.274920×10-12
C 3.975961×10-12
D -9.094950×10-13
E 2.800890×10-12
F -256.3021
G 42.62710
H -239.0681
ReferenceChase, 1998
Comment Data last reviewed in June, 1971

Solid Phase Heat Capacity (Shomate Equation)

Cp° = A + B*t + C*t2 + D*t3 + E/t2
H° − H°298.15= A*t + B*t2/2 + C*t3/3 + D*t4/4 − E/t + F − H
S° = A*ln(t) + B*t + C*t2/2 + D*t3/3 − E/(2*t2) + G
    Cp = heat capacity (cal/mol*K)
    H° = standard enthalpy (kcal/mol)
    S° = standard entropy (cal/mol*K)
    t = temperature (K) / 1000.

View plot Requires a JavaScript / HTML 5 canvas capable browser.

View table.

Temperature (K) 298. - 1117.
A 13.99880
B 11.09560
C 1.349021
D -0.285865
E -0.265350
F -249.1671
G 24.45220
H -243.5999
ReferenceChase, 1998
Comment Data last reviewed in June, 1971

References

Neubert, 1985
Neubert, A., Investigation of gaseous LiBO by Knudsen effusion mass spectrometry, J. Chem. Phys., 1985, 82, 939. [all data]