Molybdenum bromide

Gas phase thermochemistry data

Quantity Value Units Method Reference Comment
Δfgas167.36kJ/molReviewChase, 1998Data last reviewed in September, 1978
Quantity Value Units Method Reference Comment
gas,1 bar320.95J/mol*KReviewChase, 1998Data last reviewed in September, 1978

Gas Phase Heat Capacity (Shomate Equation)

Cp° = A + B*t + C*t2 + D*t3 + E/t2
H° − H°298.15= A*t + B*t2/2 + C*t3/3 + D*t4/4 − E/t + F − H
S° = A*ln(t) + B*t + C*t2/2 + D*t3/3 − E/(2*t2) + G
    Cp = heat capacity (J/mol*K)
    H° = standard enthalpy (kJ/mol)
    S° = standard entropy (J/mol*K)
    t = temperature (K) / 1000.

View plot Requires a JavaScript / HTML 5 canvas capable browser.

View table.

Temperature (K) 298. - 1300.1300. - 6000.
A 73.7091164.84614
B 2.273038-3.087965
C -14.909641.250724
D 6.617456-0.111798
E -0.3531535.310626
F 144.2154157.6029
G 408.0948410.3450
H 167.3600167.3600
ReferenceChase, 1998Chase, 1998
Comment Data last reviewed in September, 1978 Data last reviewed in September, 1978

Condensed phase thermochemistry data

Quantity Value Units Method Reference Comment
Δfsolid-202.92kJ/molReviewChase, 1998Data last reviewed in September, 1978
Quantity Value Units Method Reference Comment
solid124.68J/mol*KReviewChase, 1998Data last reviewed in September, 1978

Solid Phase Heat Capacity (Shomate Equation)

Cp° = A + B*t + C*t2 + D*t3 + E/t2
H° − H°298.15= A*t + B*t2/2 + C*t3/3 + D*t4/4 − E/t + F − H
S° = A*ln(t) + B*t + C*t2/2 + D*t3/3 − E/(2*t2) + G
    Cp = heat capacity (J/mol*K)
    H° = standard enthalpy (kJ/mol)
    S° = standard entropy (J/mol*K)
    t = temperature (K) / 1000.

View plot Requires a JavaScript / HTML 5 canvas capable browser.

View table.

Temperature (K) 298. - 1800.
A 76.57055
B 10.45268
C 0.005435
D -0.001335
E -0.000224
F -226.2188
G 214.2283
H -202.9240
ReferenceChase, 1998
Comment Data last reviewed in September, 1978

References

Chase, 1998
Chase, M.W., Jr., NIST-JANAF Themochemical Tables, Fourth Edition, J. Phys. Chem. Ref. Data, Monograph 9, 1998, 1-1951. [all data]