triuranium octaoxide

Condensed phase thermochemistry data

Quantity Value Units Method Reference Comment
Δfsolid-854.40 ± 0.60kcal/molReviewCox, Wagman, et al., 1984CODATA Review value
Quantity Value Units Method Reference Comment
solid,1 bar67.53 ± 0.12cal/mol*KReviewCox, Wagman, et al., 1984CODATA Review value

References

Cox, Wagman, et al., 1984
Cox, J.D.; Wagman, D.D.; Medvedev, V.A., CODATA Key Values for Thermodynamics, Hemisphere Publishing Corp., New York, 1984, 1. [all data]