titanium trioxide

Gas phase ion energetics data

Data compiled by: John E. Bartmess

Electron affinity determinations

EA (eV) Method Reference Comment
4.20 ± 0.10LPESWu and Wang, 1997

References

Wu and Wang, 1997
Wu, H.; Wang, L.-S., Electronic Structures of Titanium Oxide Clusters: TiOy (y=1-3) and (TiO2)n (n=1-4), J. Phys. Chem., 1997, 107, 20, 8221, https://doi.org/10.1063/1.475026 . [all data]