dititanium trioxide

Condensed phase thermochemistry data

Quantity Value Units Method Reference Comment
Δfliquid-339.020kcal/molReviewChase, 1998Data last reviewed in June, 1973
Quantity Value Units Method Reference Comment
liquid,1 bar30.382cal/mol*KReviewChase, 1998Data last reviewed in June, 1973
Quantity Value Units Method Reference Comment
Δfsolid-363.499kcal/molReviewChase, 1998Data last reviewed in June, 1973
Quantity Value Units Method Reference Comment
solid18.46cal/mol*KReviewChase, 1998Data last reviewed in June, 1973

Liquid Phase Heat Capacity (Shomate Equation)

Cp° = A + B*t + C*t2 + D*t3 + E/t2
H° − H°298.15= A*t + B*t2/2 + C*t3/3 + D*t4/4 − E/t + F − H
S° = A*ln(t) + B*t + C*t2/2 + D*t3/3 − E/(2*t2) + G
    Cp = heat capacity (cal/mol*K)
    H° = standard enthalpy (kcal/mol)
    S° = standard entropy (cal/mol*K)
    t = temperature (K) / 1000.

View plot Requires a JavaScript / HTML 5 canvas capable browser.

View table.

Temperature (K) 2115. - 3500.
A 37.50000
B -8.278022×10-8
C 2.656411×10-8
D -2.941310×10-9
E -4.336881×10-8
F -354.8760
G 67.12041
H -339.0201
ReferenceChase, 1998
Comment Data last reviewed in June, 1973

Solid Phase Heat Capacity (Shomate Equation)

Cp° = A + B*t + C*t2 + D*t3 + E/t2
H° − H°298.15= A*t + B*t2/2 + C*t3/3 + D*t4/4 − E/t + F − H
S° = A*ln(t) + B*t + C*t2/2 + D*t3/3 − E/(2*t2) + G
    Cp = heat capacity (cal/mol*K)
    H° = standard enthalpy (kcal/mol)
    S° = standard entropy (cal/mol*K)
    t = temperature (K) / 1000.

View plot Requires a JavaScript / HTML 5 canvas capable browser.

View table.

Temperature (K) 298. - 470.470. - 2115.
A 67.0139135.26551
B -158.98800.872260
C 122.1530-0.019440
D 189.39900.002823
E -1.119170-1.141021
F -381.6209-377.5930
G 133.566055.03621
H -363.5000-363.5000
ReferenceChase, 1998Chase, 1998
Comment Data last reviewed in June, 1973 Data last reviewed in June, 1973

Gas phase ion energetics data

Data compiled as indicated in comments:
LBLHLM - Sharon G. Lias, John E. Bartmess, Joel F. Liebman, John L. Holmes, Rhoda D. Levin, and W. Gary Mallard

Ionization energy determinations

IE (eV) Method Reference Comment
8.3 ± 0.5EIBalducci, Gigli, et al., 1985LBLHLM

References

Chase, 1998
Chase, M.W., Jr., NIST-JANAF Themochemical Tables, Fourth Edition, J. Phys. Chem. Ref. Data, Monograph 9, 1998, 1-1951. [all data]

Balducci, Gigli, et al., 1985
Balducci, G.; Gigli, G.; Guido, M., Identification and stability determinations for the gaseous titanium oxide molecules Ti2O3 and Ti2O4, J. Chem. Phys., 1985, 83, 1913. [all data]