aluminium oxide

Condensed phase thermochemistry data

Quantity Value Units Method Reference Comment
Δfliquid-387.326kcal/molReviewChase, 1998Data last reviewed in December, 1979
Quantity Value Units Method Reference Comment
liquid,1 bar16.07cal/mol*KReviewChase, 1998Data last reviewed in December, 1979
Quantity Value Units Method Reference Comment
Δfsolid-400.50 ± 0.31kcal/molReviewCox, Wagman, et al., 1984 corundum phase; CODATA Review value
Δfsolid-400.500kcal/molReviewChase, 1998α phase; Data last reviewed in December, 1979
Quantity Value Units Method Reference Comment
solid,1 bar12.17 ± 0.024cal/mol*KReviewCox, Wagman, et al., 1984 corundum phase; CODATA Review value

Liquid Phase Heat Capacity (Shomate Equation)

Cp° = A + B*t + C*t2 + D*t3 + E/t2
H° − H°298.15= A*t + B*t2/2 + C*t3/3 + D*t4/4 − E/t + F − H
S° = A*ln(t) + B*t + C*t2/2 + D*t3/3 − E/(2*t2) + G
    Cp = heat capacity (cal/mol*K)
    H° = standard enthalpy (kcal/mol)
    S° = standard entropy (cal/mol*K)
    t = temperature (K) / 1000.

View plot Requires a JavaScript / HTML 5 canvas capable browser.

View table.

Temperature (K) 2327. - 4000.
A 46.00000
B 2.275300×10-8
C -6.833000×10-9
D 7.000830×10-10
E 1.338290×10-8
F -420.1030
G 42.32811
H -387.3250
ReferenceChase, 1998
Comment Data last reviewed in December, 1979

Solid Phase Heat Capacity (Shomate Equation)

Cp° = A + B*t + C*t2 + D*t3 + E/t2
H° − H°298.15= A*t + B*t2/2 + C*t3/3 + D*t4/4 − E/t + F − H
S° = A*ln(t) + B*t + C*t2/2 + D*t3/3 − E/(2*t2) + G
    Cp = heat capacity (cal/mol*K)
    H° = standard enthalpy (kcal/mol)
    S° = standard entropy (cal/mol*K)
    t = temperature (K) / 1000.

View plot Requires a JavaScript / HTML 5 canvas capable browser.

View table.

Temperature (K) 298. - 2327.298. - 2327.298. - 2327.298. - 2327.
A 24.4811225.9758625.5540225.35564
B 9.2614258.8973008.7528458.684848
C -3.802797-3.395435-3.340321-3.314365
D 0.6281500.5242830.5157720.511764
E -0.718822-0.767180-0.754723-0.748860
F -410.5951-406.6922-408.8193-407.7366
G 35.1331337.0783936.2791636.79135
H -400.4995-395.9990-398.3007-397.2992
ReferenceChase, 1998Chase, 1998Chase, 1998Chase, 1998
Comment α phase; Data last reviewed in December, 1979 γ phase; Data last reviewed in December, 1979 δ phase; Data last reviewed in December, 1979 kappa phase; Data last reviewed in December, 1979

References

Chase, 1998
Chase, M.W., Jr., NIST-JANAF Themochemical Tables, Fourth Edition, J. Phys. Chem. Ref. Data, Monograph 9, 1998, 1-1951. [all data]

Cox, Wagman, et al., 1984
Cox, J.D.; Wagman, D.D.; Medvedev, V.A., CODATA Key Values for Thermodynamics, Hemisphere Publishing Corp., New York, 1984, 1. [all data]