N,N,N',N',N''-Pentamethylguanidine

Gas phase ion energetics data

Data evaluated as indicated in comments:
HL - Edward P. Hunter and Sharon G. Lias

Data compiled as indicated in comments:
RDSH - Henry M. Rosenstock, Keith Draxl, Bruce W. Steiner, and John T. Herron

Quantity Value Units Method Reference Comment
Proton affinity (review)1047.7kJ/molN/AHunter and Lias, 1998HL
Quantity Value Units Method Reference Comment
Gas basicity1015.2kJ/molN/AHunter and Lias, 1998HL

Ionization energy determinations

IE (eV) Method Reference Comment
7.84 ± 0.05EILoudon, Maccoll, et al., 1968RDSH

References

Hunter and Lias, 1998
Hunter, E.P.; Lias, S.G., Evaluated Gas Phase Basicities and Proton Affinities of Molecules: An Update, J. Phys. Chem. Ref. Data, 1998, 27, 3, 413-656, https://doi.org/10.1063/1.556018 . [all data]

Loudon, Maccoll, et al., 1968
Loudon, A.G.; Maccoll, A.; Webb, K.S., Charge location and fragmentation in mass spectrometry. II. The mass spectra and ionization potentials of some methylguanidines, Advan. Mass Spectrom., 1968, 4, 223. [all data]