N-ethyl-bis(2-chloroethyl)amine

Phase change data

Data compiled by: William E. Acree, Jr., James S. Chickos

Enthalpy of vaporization

ΔvapH (kcal/mol) Temperature (K) Method Reference Comment
13.1288.A,GSStephenson and Malanowski, 1987Based on data from 273. - 333. K. See also Redemann, Chaikin, et al., 1948 and Dykyj, 1972.

References

Stephenson and Malanowski, 1987
Stephenson, Richard M.; Malanowski, Stanislaw, Handbook of the Thermodynamics of Organic Compounds, 1987, https://doi.org/10.1007/978-94-009-3173-2 . [all data]

Redemann, Chaikin, et al., 1948
Redemann, C. Ernst; Chaikin, Saul W.; Fearing, Ralph B., The Volatility and Vapor Pressure of Ten Substituted 2-Chloroethylamines 1, J. Am. Chem. Soc., 1948, 70, 4, 1648-1650, https://doi.org/10.1021/ja01184a102 . [all data]

Dykyj, 1972
Dykyj, J., Petrochemia, 1972, 12, 1, 13. [all data]