Methyl anthranilate

Van Den Dool and Kratz RI, non-polar column, custom temperature program

Data compiled by: NIST Mass Spectrometry Data Center, William E. Wallace, director

Column type CapillaryCapillaryCapillary
Active phase HP-5MSHP-5MSVF-5MS
Column length (m) 30.30.30.
Carrier gas HeHeHe
Substrate
Column diameter (mm) 0.250.250.25
Phase thickness (μm) 0.250.250.25
Program 60C (1 min) => 5 C/min => 210C => 10 C/min => 280C (15 min)60C (1 min) => 5 C/min => 210C => 10 C/min => 280C (15 min)Multi-step temperature program; T(initial)=60C; T(final)=270C
I 1346.91345.21360.7
ReferenceAndriamaharavo, 2014Andriamaharavo, 2014Tret'yakov, 2007
Comment MSDC-RI MSDC-RI MSDC-RI

References

Andriamaharavo, 2014
Andriamaharavo, N.R., Retention Data. NIST Mass Spectrometry Data Center., NIST Mass Spectrometry Data Center, 2014. [all data]

Tret'yakov, 2007
Tret'yakov, K.V., Retention Data. NIST Mass Spectrometry Data Center., NIST Mass Spectrometry Data Center, 2007. [all data]