C6H8OSi

Gas phase ion energetics data

Data compiled by: John E. Bartmess

De-protonation reactions

C6H7OSi- + Hydrogen cation = C6H8OSi

By formula: C6H7OSi- + H+ = C6H8OSi

Quantity Value Units Method Reference Comment
Δr1484. ± 17.kJ/molG+TSDamrauer, Simon, et al., 1991gas phase; Between MeSH, tBuSH
Quantity Value Units Method Reference Comment
Δr1458. ± 17.kJ/molIMRBDamrauer, Simon, et al., 1991gas phase; Between MeSH, tBuSH

References

Damrauer, Simon, et al., 1991
Damrauer, R.; Simon, R.; Krempp, M., Effect of Substituents on the Gas-Phase Acidity of Silanols, J. Am. Chem. Soc., 1991, 113, 12, 4431, https://doi.org/10.1021/ja00012a009 . [all data]