C80

Gas phase ion energetics data

Data compiled by: John E. Bartmess

Electron affinity determinations

EA (eV) Method Reference Comment
3.170 ± 0.060IMREBoltalina, Dashkova, et al., 1996
<3.70 ± 0.20LPESYang, Pettiette, et al., 1987Threshold from graph. Onset based on analogy with Cu cluster data.

References

Boltalina, Dashkova, et al., 1996
Boltalina, O.V.; Dashkova, E.V.; Sidorov, L.N., Gibbs Energies of Gas-phase Electron Transfer Reactions involving the Larger Fullerene Anions, Chem. Phys. Lett., 1996, 256, 3, 253, https://doi.org/10.1016/0009-2614(96)00460-5 . [all data]

Yang, Pettiette, et al., 1987
Yang, S.H.; Pettiette, C.L.; Conceicao, J.; Cheshnovsky, O.; Smalley, R.E., UPS of Buckminsterfullerene and other Large Clusters of Carbon, Chem. Phys. Lett., 1987, 139, 3-4, 233, https://doi.org/10.1016/0009-2614(87)80548-1 . [all data]