2-Propenoic acid, hexadecyl ester

Kovats' RI, non-polar column, isothermal

View large format table.

Column type Active phase Temperature (C) I Reference Comment
CapillaryOV-101200.2077.Horna, Táborský, et al., 1985N2; Column length: 19. m; Column diameter: 0.28 mm

Kovats' RI, polar column, isothermal

View large format table.

Column type Active phase Temperature (C) I Reference Comment
CapillarySP-1000200.2402.Horna, Táborský, et al., 1985N2; Column length: 46. m; Column diameter: 0.23 mm

References

Horna, Táborský, et al., 1985
Horna, A.; Táborský, J.; Dufka, O.; Matousek, P.; Churácek, J., Chromatography of monomers. II. Glass capillary gas chromatography of C1-C18 alkyl esters of acrylic and methacrylic acids, J. Chromatogr., 1985, 325, 367-378, https://doi.org/10.1016/S0021-9673(00)96047-3 . [all data]