2-Cyclohexen-1-one, 4,4,6-trimethyl-

Normal alkane RI, polar column, custom temperature program

View large format table.

Column type Active phase I Reference Comment
CapillaryNB-3511646.Kerrola and Kallio, 199425. m/0.32 mm/0.2 μm, He; Program: 35C(5min) => 2.5C/min => 150C => 5C/min => 240C (20min)

References

Kerrola and Kallio, 1994
Kerrola, K.M.; Kallio, H.P., Extraction of volatile compounds of angelica (Angelica archangelica L.) root by liquid carbon dioxide, J. Agric. Food Chem., 1994, 42, 10, 2235-2245, https://doi.org/10.1021/jf00046a030 . [all data]