Vanadium trimer

Gas phase ion energetics data

Data compiled as indicated in comments:
LL - Sharon G. Lias and Joel F. Liebman
B - John E. Bartmess

Electron affinity determinations

EA (eV) Method Reference Comment
1.010 ± 0.060LPESIseda, Nishio, et al., 1997EA set as 5% threshold for first peak.; B

Ionization energy determinations

IE (eV) Method Reference Comment
5.4978 ± 0.0004TEYang, James, et al., 1994LL

References

Iseda, Nishio, et al., 1997
Iseda, M.; Nishio, T.; Han, S.Y.; Yoshida, H.; Terasaki, A.; Kondow, T., Electronic Structure of Vanadium Cluster Anions as Studied by Photoelectron Spectroscopy, J. Chem. Phys., 1997, 106, 6, 2182, https://doi.org/10.1063/1.473785 . [all data]

Yang, James, et al., 1994
Yang, D.S.; James, A.M.; Rayner, D.M.; Hackett, P.A., Pulsed field ionization zero kinetic energy photoelectron spectroscopy of small vanadium clusters. Using velocity slip as a mass selector, Chem. Phys. Lett., 1994, 231, 177. [all data]