tetrakis(2,6,6-trimethyl-2-methoxy-3,5-heptanedionato)uranium(IV)

Phase change data

Data compiled by: William E. Acree, Jr., James S. Chickos

Enthalpy of sublimation

ΔsubH (kcal/mol) Temperature (K) Reference Comment
38.4 ± 1.5408.Sevast'yanov, Krasnodubskaya, et al., 1991Based on data from 387. - 428. K.

References

Sevast'yanov, Krasnodubskaya, et al., 1991
Sevast'yanov, V.G.; Krasnodubskaya, S.V.; Kurtasov, O.V.; Alikhanyan, A.S.; Kuznetsov, N.T.; Zanina, A.S., Synthesis and thermochemistry of vapor formation in tetrakis(2,6,6-trimethyl-2-methoxy-3,5-heptanedionato)uranium, U(ODPM)4 (I) and tetrakis(2,6-dimethyl-2-methoxy-3,5-heptanedionato)uranium, U(OPPM)4 (II), Vysokochist. Veshchestva, 1991, 1, 190. [all data]