c80-Fullerene

Gas phase ion energetics data

Data compiled by: Sharon G. Lias and Joel F. Liebman

Ionization energy determinations

IE (eV) Method Reference
6.84 ± 0.10IMBZimmerman and Eyler, 1991

References

Zimmerman and Eyler, 1991
Zimmerman, J.A.; Eyler, J.R., 'Magic number' carbon clusters: Ionization potentials and selective reactivity, J. Chem. Phys., 1991, 94, 3556. [all data]