CH3COOCa

Vibrational and/or electronic energy levels

Data compiled by: Marilyn E. Jacox

State:   B,C

 Energy
 (cm-1
 Med.   Transition   λmin
 (nm)
 λmax
 (nm)

References

To = 15850 ± 20 gas O'Brien, Brazier, et al., 1990

Vib.
sym.
 No.   Approximate
 type of mode
 cm-1   Med.   Method   References

a1 Ca..O2C str. 341 ± 10 gas LF O'Brien, Brazier, et al., 1990

State:   A

 Energy
 (cm-1
 Med.   Transition   λmin
 (nm)
 λmax
 (nm)

To = 14573 ± 20 gas O'Brien, Brazier, et al., 1990

Vib.
sym.
 No.   Approximate
 type of mode
 cm-1   Med.   Method   References

a1 Ca..O2C str. 347 ± 10 gas LF O'Brien, Brazier, et al., 1990

State:   X

Vib.
sym.
 No.   Approximate
 type of mode
 cm-1   Med.   Method   References

a1 Ca..O2C str. 332 ± 10 gas LF O'Brien, Brazier, et al., 1990

Additional references: Jacox, 1994, page 379

O'Brien, Brazier, et al., 1990
O'Brien, L.C.; Brazier, C.R.; Kinsey-Nielsen, S.; Bernath, P.F., Gas-phase inorganic chemistry: laser spectroscopy of calcium and strontium monocarboxylates, J. Phys. Chem., 1990, 94, 9, 3543, https://doi.org/10.1021/j100372a034 . [all data]

Jacox, 1994
Jacox, M.E., Vibrational and electronic energy levels of polyatomic transient molecules, American Chemical Society, Washington, DC, 1994, 464. [all data]