InH2

Vibrational and/or electronic energy levels

Data compiled by: Marilyn E. Jacox

State:   X

Vib.
sym.
 No.   Approximate
 type of mode
 cm-1   Med.   Method   References

a1 1 Sym. stretch 1570 Ne IR Wang and Andrews, 2004
1 Sym. stretch 1548.6 w m Ar IR Pullumbi, Mijoule, et al., 1994
1 Sym. stretch 1563.3 H2 IR Andrews and Wang, 2004
Wang and Andrews, 2004
2 Bend 607.4 w m Ar IR Pullumbi, Mijoule, et al., 1994
b2 3 Asym. stretch 1636 Ne IR Wang and Andrews, 2004
3 Asym. stretch 1615.6 vs Ar IR Pullumbi, Mijoule, et al., 1994
3 Asym. stretch 1628.9 H2 IR Andrews and Wang, 2004
Wang and Andrews, 2004

Additional references: Jacox, 1998, page 129

References

Wang and Andrews, 2004
Wang, X.; Andrews, L., Infrared Spectra of Indium Hydrides in Solid Hydrogen and Neon, J. Phys. Chem. A, 2004, 108, 20, 4440, https://doi.org/10.1021/jp037942l . [all data]

Pullumbi, Mijoule, et al., 1994
Pullumbi, P.; Mijoule, C.; Manceron, L.; Bouteiller, Y., Aluminium, gallium and indium dihydrides. An IR matrix isolation and ab initio study, Chem. Phys., 1994, 185, 1, 13, https://doi.org/10.1016/0301-0104(94)00110-3 . [all data]

Andrews and Wang, 2004
Andrews, L.; Wang, X., Infrared Spectra of Indium Hydrides in Solid Hydrogen and of Solid Indane, Angew. Chem. Int. Ed., 2004, 43, 13, 1706, https://doi.org/10.1002/anie.200353216 . [all data]

Jacox, 1998
Jacox, M.E., Vibrational and electronic energy levels of polyatomic transient molecules: supplement A, J. Phys. Chem. Ref. Data, 1998, 27, 2, 115-393, https://doi.org/10.1063/1.556017 . [all data]