1-Pentyne, 4,4-dimethyl-

Phase change data

Data compiled by: Thermodynamics Research Center, NIST Boulder Laboratories, Chris Muzny director

Quantity Value Units Method Reference Comment
Tboil349.23KN/AMiller, Greenlee, et al., 1954Uncertainty assigned by TRC = 0.3 K
Tboil347.15KN/AOzanne and Marvel, 1930Uncertainty assigned by TRC = 2. K
Quantity Value Units Method Reference Comment
Tfus168.33KN/AMiller, Greenlee, et al., 1954Uncertainty assigned by TRC = 2. K

In addition to the Thermodynamics Research Center (TRC) data available from this site, much more physical and chemical property data is available from the following TRC products:

References

Miller, Greenlee, et al., 1954
Miller, H.M.; Greenlee, K.W.; Derfer, J.M.; Boord, C.E., J. Org. Chem., 1954, 19, 1882. [all data]

Ozanne and Marvel, 1930
Ozanne, I.L.; Marvel, C.S., Hexa-omega-tertiary-butylpropinylethane and some new acetylenic carbinols., J. Am. Chem. Soc., 1930, 52, 5267-72. [all data]