Pyrazine, 3-ethyl-2,5-dimethyl-

Normal alkane RI, non-polar column, temperature ramp

Data compiled by: NIST Mass Spectrometry Data Center, William E. Wallace, director

Column type CapillaryCapillaryCapillaryCapillaryCapillary
Active phase HP-5 MSHP-5 MSDB-5Ultra-1HP-5
Column length (m) 30.30.30.50.50.
Carrier gas HeliumHeliumHeliumHeliumHelium
Substrate
Column diameter (mm) 0.250.250.250.200.20
Phase thickness (μm) 0.250.250.250.330.33
Tstart (C) 45.50.50.50.50.
Tend (C) 280.250.220.280.280.
Heat rate (K/min) 15.5.4.2.10.
Initial hold (min)  0.5
Final hold (min)  0.5 20.8.5
I 1083.1079.1063.1054.1085.
ReferenceWanakhachornkrai and Lertsiri, 9999Fanaro, Duarte, et al., 2012Shedid, 2010Du, Clery, et al., 2008Du, Clery, et al., 2008
Comment MSDC-RI MSDC-RI MSDC-RI MSDC-RI MSDC-RI
Column type CapillaryCapillaryCapillaryCapillaryCapillary
Active phase SLB-5MSDB-5DB-5 MSMDN-5MDN-5
Column length (m) 10.30.30.60.60.
Carrier gas HeliumHe HeHe
Substrate
Column diameter (mm) 0.180.320.250.250.25
Phase thickness (μm) 0.181.0.250.250.25
Tstart (C) 40.40.40.40.40.
Tend (C) 295.250.200.270.270.
Heat rate (K/min) 10.4.8.4.4.
Initial hold (min) 1.52.3.4.4.
Final hold (min)  15.20.5.5.
I 1093.1089.1091.1079.1080.
ReferenceRisticevic, Carasek, et al., 2008Fan and Qian, 2006Schirack, Drake, et al., 2006van Loon, Linssen, et al., 2005van Loon, Linssen, et al., 2005
Comment MSDC-RI MSDC-RI MSDC-RI MSDC-RI MSDC-RI
Column type CapillaryCapillaryCapillaryCapillaryCapillary
Active phase HP-5DB-5DB-5MSDB-1HP-5
Column length (m) 30.30.50.60.50.
Carrier gas HeHeHeHe
Substrate
Column diameter (mm) 0.250.320.250.320.32
Phase thickness (μm) 0.250.25 1.0.52
Tstart (C) 45.40.40.40.35.
Tend (C) 280.230.220.260.250.
Heat rate (K/min) 15.6.5.2.2.
Initial hold (min) 2.2.5. 15.
Final hold (min) 11.45.5. 45.
I 1083.1079.1080.1072.1080.
ReferenceWanakhachornkrai and Lertsiri, 2003Sanz, Czerny, et al., 2002Welty, Marshall, et al., 2001Chen and Ho, 1999Boylston and Viniyard, 1998
Comment MSDC-RI MSDC-RI MSDC-RI MSDC-RI MSDC-RI
Column type CapillaryCapillaryCapillaryCapillaryCapillary
Active phase DB-1DB-1DB-1DB-1DB-1
Column length (m) 60.60.60.60.60.
Carrier gas He HeHeHe
Substrate
Column diameter (mm) 0.320.250.320.250.25
Phase thickness (μm) 1.0 1. 1.
Tstart (C) 40.30.40.30.40.
Tend (C) 260.200.280.200.260.
Heat rate (K/min) 3.4.2.4.2.
Initial hold (min)  25.2.25.5.
Final hold (min)  20.40.20.60.
I 1098.1054.1061.1054.1071.
ReferenceChen and Ho, 1998Buttery, Ling, et al., 1997Lu, Yu, et al., 1997Buttery and Ling, 1995Yu and Ho, 1995
Comment MSDC-RI MSDC-RI MSDC-RI MSDC-RI MSDC-RI
Column type CapillaryCapillaryCapillaryPackedCapillary
Active phase DB-1DB-1DB-1SE-54HP-5
Column length (m) 60.60.60.3.50.
Carrier gas HeHeHe H2
Substrate    Chromosorb G AW DMCS (100-120 mesh)
Column diameter (mm) 0.320.250.25 0.3
Phase thickness (μm)  1.01.
Tstart (C) 30.40.40.50.80.
Tend (C) 200.260.260.230.250.
Heat rate (K/min) 4.2.2.6.16.
Initial hold (min) 25.5.5.2.
Final hold (min) 20.60.60.10.
I 1054.1086.1067.1082.1082.
ReferenceButtery, Stern, et al., 1994Yu, Wu, et al., 1994Yu, Wu, et al., 1994, 2Schieberle, 1991Spadone, Takeoka, et al., 1990
Comment MSDC-RI MSDC-RI MSDC-RI MSDC-RI MSDC-RI
Column type CapillaryCapillaryCapillaryCapillaryCapillary
Active phase DB-1DB-1DB-1DB-1OV-101
Column length (m) 60.60.60.60.50.
Carrier gas     N2
Substrate
Column diameter (mm) 0.320.320.320.320.22
Phase thickness (μm) 0.250.250.250.25
Tstart (C) 50.50.50.50.80.
Tend (C) 250.250.250.250.200.
Heat rate (K/min) 4.4.4.4.2.
Initial hold (min)
Final hold (min)
I 1053.1054.1055.1055.1059.
ReferenceFlath, Matsumoto, et al., 1989Flath, Matsumoto, et al., 1989Flath, Matsumoto, et al., 1989Flath, Matsumoto, et al., 1989Mihara and Masuda, 1987
Comment MSDC-RI MSDC-RI MSDC-RI MSDC-RI MSDC-RI
Column type CapillaryCapillaryCapillaryCapillaryCapillary
Active phase OV-1DB-5OV-101Methyl SiliconeMethyl Silicone
Column length (m) 50.60.50.25.25.
Carrier gas HydrogenH2He
Substrate
Column diameter (mm) 0.200.320.310.20.2
Phase thickness (μm)
Tstart (C) 50.40.0.50.50.
Tend (C) 200.200.225.200.200.
Heat rate (K/min) 1.2.3.4.4.
Initial hold (min)   1.
Final hold (min) 35.  15.15.
I 1051.1071.1051.1051.1054.
ReferenceWu, Liou, et al., 1987Gallois and Grimont, 1985del Rosario, de Lumen, et al., 1984Lorenz, Stern, et al., 1983Lorenz, Stern, et al., 1983
Comment MSDC-RI MSDC-RI MSDC-RI MSDC-RI MSDC-RI
Column type Capillary
Active phase SE-30
Column length (m) 50.
Carrier gas He
Substrate
Column diameter (mm) 0.5
Phase thickness (μm)
Tstart (C) 40.
Tend (C) 170.
Heat rate (K/min) 3.
Initial hold (min) 3.
Final hold (min)
I 1055.
ReferenceHeydanek and McGorrin, 1981
Comment MSDC-RI

Van Den Dool and Kratz RI, polar column, temperature ramp

Data compiled by: NIST Mass Spectrometry Data Center, William E. Wallace, director

Column type CapillaryCapillaryCapillaryCapillaryCapillary
Active phase DB-WaxDB-WaxCP-Wax 52CBCP-Wax 52CBDB-Wax
Column length (m) 30.30.50.50.60.
Carrier gas HeHe  He
Substrate
Column diameter (mm) 0.250.250.320.320.25
Phase thickness (μm) 0.50.5  0.25
Tstart (C) 40.40.60.60.40.
Tend (C) 250.250.220.220.200.
Heat rate (K/min) 4.4.4.4.2.
Initial hold (min) 5.5.5.5.5.
Final hold (min) 15.15.30.30.30.
I 1447.1450.1433.1443.1444.
ReferencePozo-Bayon M.A., Ruiz-Rodriguez A., et al., 2007Pozo-Bayon M.A., Ruiz-Rodriguez A., et al., 2007Mahadevan and Farmer, 2006Mahadevan and Farmer, 2006Kim, 2001
Comment MSDC-RI MSDC-RI MSDC-RI MSDC-RI MSDC-RI
Column type CapillaryCapillaryCapillaryCapillaryCapillary
Active phase Supelcowax-10FFAPPEG-20MDB-WaxDB-Wax
Column length (m) 60.60.60.60.60.
Carrier gas He HeHeHe
Substrate
Column diameter (mm) 0.250.250.250.250.25
Phase thickness (μm) 0.250.50.250.250.25
Tstart (C) 35.50.50.50.50.
Tend (C) 195.230.230.230.230.
Heat rate (K/min) 2.5.2.3.2.
Initial hold (min) 5.3.
Final hold (min) 90.15.60. 60.
I 1446.1477.1449.1438.1449.
ReferenceChung, 1999Stephan and Steinhart, 1999Shimoda, Nakada, et al., 1997Shimoda, Peralta, et al., 1996Shimoda, Shiratsuchi, et al., 1996
Comment MSDC-RI MSDC-RI MSDC-RI MSDC-RI MSDC-RI
Column type CapillaryCapillaryCapillaryCapillaryCapillary
Active phase DB-WaxCP-Wax 52CBSupelcowax-10Supelcowax-10CP-WAX 57CB
Column length (m) 60.50.60.60.50.
Carrier gas  H2
Substrate
Column diameter (mm) 0.250.320.250.250.32
Phase thickness (μm) 0.25 0.250.25
Tstart (C) 50.50.40.40.60.
Tend (C) 230.200.175.175.200.
Heat rate (K/min) 2.1.52.2.4.
Initial hold (min)  10.5.5.5.
Final hold (min)  80.20.20.
I 1439.1408.1446.1447.1449.
ReferenceShimoda, Shigematsu, et al., 1995Wu and Liou, 1992Tanchotikul and Hsieh, 1989Tanchotikul and Hsieh, 1989Salter L.J., Mottram D.S., et al., 1988
Comment MSDC-RI MSDC-RI MSDC-RI MSDC-RI MSDC-RI
Column type CapillaryCapillary
Active phase CP-WAX 57CBCP-WAX 57CB
Column length (m) 50.50.
Carrier gas HeHe
Substrate
Column diameter (mm) 0.320.32
Phase thickness (μm)
Tstart (C) 60.60.
Tend (C) 200.200.
Heat rate (K/min) 4.4.
Initial hold (min) 5.5.
Final hold (min) 10.10.
I 1449.1450.
ReferenceWhitfield, Mottram, et al., 1988Whitfield, Mottram, et al., 1988
Comment MSDC-RI MSDC-RI

Van Den Dool and Kratz RI, polar column, custom temperature program

Data compiled by: NIST Mass Spectrometry Data Center, William E. Wallace, director

Column type CapillaryCapillaryCapillaryCapillaryCapillary
Active phase FFAPCP-Wax 52CBFFAPSupelcowax-10DB-Wax
Column length (m) 25.60.30.60.30.
Carrier gas HeHeHe He
Substrate
Column diameter (mm) 0.320.250.320.250.32
Phase thickness (μm) 0.20.250.250.250.25
Program 40C(1min) => 40C/min => 60C(1min) => 6C/min => 180C => 15C/min => 240C40C => 5C/min => 60C => 2.5C/min => 155C35C (2min) => 40C/min => 60C (2min) => 6C/min => 180C (5min) => 10C/min => 230C (5min)40C => (6C/min) => 80C(6min) => (15C/min) => 200C(10min)35C(2min) => 6C/min => 150C => 30C/min => 240C(1min)
I 1429.1438.1430.1439.1441.
ReferenceFrauendorfer and Schieberle, 2006Alasalvar, Shahidi, et al., 2003Tairu, Hofmann, et al., 2000Baek and Cadwallader, 1996Amrani-Hemaimi, Cerny, et al., 1995
Comment MSDC-RI MSDC-RI MSDC-RI MSDC-RI MSDC-RI

Kovats' RI, polar column, temperature ramp

Data compiled by: NIST Mass Spectrometry Data Center, William E. Wallace, director

Column type Capillary
Active phase DB-Wax
Column length (m) 60.
Carrier gas He
Substrate
Column diameter (mm) 0.25
Phase thickness (μm)
Tstart (C) 40.
Tend (C) 190.
Heat rate (K/min) 3.
Initial hold (min) 6.
Final hold (min)
I 1455.
ReferenceShimoda and Shibamoto, 1990
Comment MSDC-RI

References

Wanakhachornkrai and Lertsiri, 9999
Wanakhachornkrai, P.; Lertsiri, S., Comparison of determination method for volatile compounds in Thai soy sauce, Analytical, Nutritional and Clinical Methods, 9999, 1-11. [all data]

Fanaro, Duarte, et al., 2012
Fanaro, G.B.; Duarte, R.C.; Santillo, A.G.; Pinto e Silva, M.E.M.; Purgatto, E.; Villavicento, A.L.C.H., Evaluation of γ-radiation on oolong tea odor volatiles, Radiation Phys. Chem., 2012, 81, 8, 1152-1156, https://doi.org/10.1016/j.radphyschem.2011.11.061 . [all data]

Shedid, 2010
Shedid, S., Chemical composition and antioxidant activity of Mallard reaction products generated from glutathione or Cysteine/glucose, World Appl. Sci. J., 2010, 9, 10, 1148-1154. [all data]

Du, Clery, et al., 2008
Du, Z.; Clery, R.; Hammond, C.J., Volatile organic nitrogen-containing constituents in ambrette seed Abelmoschus moschatus Medik (Malvaceae), J. Agric. Food Chem., 2008, 56, 16, 7388-7392, https://doi.org/10.1021/jf800958d . [all data]

Risticevic, Carasek, et al., 2008
Risticevic, S.; Carasek, E.; Pawliszyn, J., Headspace solid-phase microextraction-gas chromatographic-time-of-flight mass spectrometric methodology for geographical origin verification of coffee, Anal. Chim. Acta, 2008, 617, 1-2, 72-84, https://doi.org/10.1016/j.aca.2008.04.009 . [all data]

Fan and Qian, 2006
Fan, W.; Qian, M.C., Characterization of Aroma Compounds of Chinese Wuliangye and Jiannanchun Liquors by Aroma Extract Dilution Analysis, J. Agric. Food Chem., 2006, 54, 7, 2695-2704, https://doi.org/10.1021/jf052635t . [all data]

Schirack, Drake, et al., 2006
Schirack, A.V.; Drake, M.A.; Sander, T.H.; Sandeep, K.P., Characterization of aroma-active compounds in microwave blanched peanuts, J. Food Sci., 2006, 71, 9, c513-c520, https://doi.org/10.1111/j.1750-3841.2006.00173.x . [all data]

van Loon, Linssen, et al., 2005
van Loon, W.A.M.; Linssen, J.P.H.; Legger, A.; Posthumus, M.A.; Voragen, A.G.J., Identification and olfactometry of French fries flavour extracted at mouth conditions, Food Chem., 2005, 90, 3, 417-425, https://doi.org/10.1016/j.foodchem.2004.05.005 . [all data]

Wanakhachornkrai and Lertsiri, 2003
Wanakhachornkrai, P.; Lertsiri, S., Analytical, nutritional, and clinical methods. Comparison of determination method for volatile compounds in Thai soy sauce, Food Chem., 2003, 83, 4, 619-629, https://doi.org/10.1016/S0308-8146(03)00256-5 . [all data]

Sanz, Czerny, et al., 2002
Sanz, C.; Czerny, M.; Cid, C.; Schieberle, P., Comparison of potent odorants in a filtered coffee brew and in an instant coffee beverage by aroma extract dilution analysis (AEDA), Eur. Food Res. Technol., 2002, 214, 4, 299-302, https://doi.org/10.1007/s00217-001-0459-9 . [all data]

Welty, Marshall, et al., 2001
Welty, W.M.; Marshall, R.T.; Grün, I.U.; Ellersieck, M.R., Effects of Milk Fat, Cocoa Butter, or Selected Fat Replacers on Flavor Volatiles of Chocolate Ice Cream, J. Dairy Sci., 2001, 84, 1, 21-30, https://doi.org/10.3168/jds.S0022-0302(01)74447-5 . [all data]

Chen and Ho, 1999
Chen, J.; Ho, C.-T., Comparison of volatile generation in serine/threonine/glutamine-ribose/glucose/fructose model systems, J. Agric. Food Chem., 1999, 47, 2, 643-647, https://doi.org/10.1021/jf980771a . [all data]

Boylston and Viniyard, 1998
Boylston, T.D.; Viniyard, B.T., Isolation of volatile flavor compounds from peanut butter using purge-and-trap technique in Instrumental Methods in Food and Beverage Analysis, D. Wetzel and G. Charalambous, ed(s)., 1998, 225-243. [all data]

Chen and Ho, 1998
Chen, J.; Ho, C.-T., Volatile compounds formed from thermal degradation of glucosamine in a dry system, J. Agric. Food Chem., 1998, 46, 5, 1971-1974, https://doi.org/10.1021/jf971021o . [all data]

Buttery, Ling, et al., 1997
Buttery, R.G.; Ling, L.C.; Stern, D.J., Studies on popcorn aroma and flavor volatiles, J. Agric. Food Chem., 1997, 45, 3, 837-843, https://doi.org/10.1021/jf9604807 . [all data]

Lu, Yu, et al., 1997
Lu, G.; Yu, T.-H.; Ho, C.-T., Generation of flavor compounds by the reaction of 2-deoxyglucose with selected amino acids, J. Agric. Food Chem., 1997, 45, 1, 233-236, https://doi.org/10.1021/jf960609c . [all data]

Buttery and Ling, 1995
Buttery, R.G.; Ling, L.C., Volatile flavor components of corn tortillas and related products, J. Agric. Food Chem., 1995, 43, 7, 1878-1882, https://doi.org/10.1021/jf00055a023 . [all data]

Yu and Ho, 1995
Yu, T.-H.; Ho, C.-T., Volatile compounds generated from thermal reaction of methionine and methionine sulfoxide with or without glucose, J. Agric. Food Chem., 1995, 43, 6, 1641-1646, https://doi.org/10.1021/jf00054a043 . [all data]

Buttery, Stern, et al., 1994
Buttery, R.G.; Stern, D.J.; Ling, L.C., Studies on flavor volatiles of some sweet corn products, J. Agric. Food Chem., 1994, 42, 3, 791-795, https://doi.org/10.1021/jf00039a038 . [all data]

Yu, Wu, et al., 1994
Yu, T.-H.; Wu, C.-M.; Ho, C.-T., Meat-like flavor generated from thermal interactions of glucose and alliin or deoxyalliin, J. Agric. Food Chem., 1994, 42, 4, 1005-1009, https://doi.org/10.1021/jf00040a032 . [all data]

Yu, Wu, et al., 1994, 2
Yu, T.-H.; Wu, C.-M.; Ho, C.-T., Volatile compounds generated from the thermal interaction of glucose and alliin or deoxyalliin in propylene glycol, Food Chem., 1994, 51, 3, 281-286, https://doi.org/10.1016/0308-8146(94)90028-0 . [all data]

Schieberle, 1991
Schieberle, P., Primary odorants in popcorn, J. Agric. Food Chem., 1991, 39, 6, 1141-1144, https://doi.org/10.1021/jf00006a030 . [all data]

Spadone, Takeoka, et al., 1990
Spadone, J.-C.; Takeoka, G.; Liardon, R., Analytical Investigation of Rio Off-Flavor in Green Coffee, J. Agric. Food Chem., 1990, 38, 1, 226-233, https://doi.org/10.1021/jf00091a050 . [all data]

Flath, Matsumoto, et al., 1989
Flath, R.A.; Matsumoto, K.E.; Binder, R.G.; Cunningham, R.T.; Mon, T.R., Effect of pH on the volatiles of hydrolyzed protein insect baits, J. Agric. Food Chem., 1989, 37, 3, 814-819, https://doi.org/10.1021/jf00087a053 . [all data]

Mihara and Masuda, 1987
Mihara, S.; Masuda, H., Correlation between molecular structures and retention indices of pyrazines, J. Chromatogr., 1987, 402, 309-317, https://doi.org/10.1016/0021-9673(87)80029-8 . [all data]

Wu, Liou, et al., 1987
Wu, C.-M.; Liou, S.-E.; Chang, Y.-H.; Chiang, W., Volatile compounds of the wax gourd (Benincasa hispida, Cogn) and a wax gourd beverage, J. Food Sci., 1987, 52, 1, 132-134, https://doi.org/10.1111/j.1365-2621.1987.tb13988.x . [all data]

Gallois and Grimont, 1985
Gallois, A.; Grimont, P.A.D., Pyrazines responsible for the potatolike odor produced by some Serratia and Cedecea strains, Appl. Environ. Microbiol., 1985, 10, 1048-1051. [all data]

del Rosario, de Lumen, et al., 1984
del Rosario, R.; de Lumen, B.O.; Habu, T.; Flath, R.A.; Mon, T.R.; Teranishi, R., Comparison of headspace volatiles from winged beans and soybeans, J. Agric. Food Chem., 1984, 32, 5, 1011-1015, https://doi.org/10.1021/jf00125a015 . [all data]

Lorenz, Stern, et al., 1983
Lorenz, G.; Stern, D.J.; Flath, R.A.; Haddon, W.F.; Tillin, S.J.; Teranishi, R., Identification of sheep liver volatiles, J. Agric. Food Chem., 1983, 31, 5, 1052-1057, https://doi.org/10.1021/jf00119a033 . [all data]

Heydanek and McGorrin, 1981
Heydanek, M.G.; McGorrin, R.J., Gas chromatography-mass spectroscopy investigations on the flavor chemistry of oat groats, J. Agric. Food Chem., 1981, 29, 5, 950-954, https://doi.org/10.1021/jf00107a016 . [all data]