Pyrazine, 2-ethyl-5-methyl-

Normal alkane RI, polar column, temperature ramp

Data compiled by: NIST Mass Spectrometry Data Center, William E. Wallace, director

Column type CapillaryCapillaryCapillaryCapillaryCapillary
Active phase HP-InnowaxFFAPDB-WaxHP-InnowaxZB-Wax
Column length (m) 15.30.60.50.60.
Carrier gas HeliumNitrogenHeliumHeliumHelium
Substrate
Column diameter (mm) 0.320.320.250.200.32
Phase thickness (μm) 0.500.500.500.330.50
Tstart (C) 40.35.40.50.40.
Tend (C) 250.250.210.250.220.
Heat rate (K/min) 3.4.2.10.4.
Initial hold (min)  5.5. 5.
Final hold (min)  45.70.6.5.
I 1369.1405.1415.1378.1428.
ReferencePuvipirom and Chaisei, 2012Budryn, Nebesny, et al., 2011Moon and Shibamoto, 2009Du, Clery, et al., 2008Marin, Pozrl, et al., 2008
Comment MSDC-RI MSDC-RI MSDC-RI MSDC-RI MSDC-RI
Column type CapillaryCapillaryCapillaryCapillaryCapillary
Active phase DB-WaxFFAPDB-WaxTC-WaxDB-Wax
Column length (m) 30.30.60.60.30.
Carrier gas HeN2HeHe
Substrate
Column diameter (mm) 0.250.320.250.250.25
Phase thickness (μm) 0.250.50.250.50.25
Tstart (C) 50.35.50.40.30.
Tend (C) 230.320.200.230.250.
Heat rate (K/min) 4.4.2.3.4.
Initial hold (min)  5. 8.1.
Final hold (min) 15.45.90.
I 1387.1405.1362.1403.1392.
ReferenceCharacterization of Pyrazines in Some Chinese Liquors and Their Approximate Concentrations, 2007Nebesny, Budryn, et al., 2007Fujioka and Shibamoto, 2006Ishikawa, Ito, et al., 2004Tanaka, Yamauchi, et al., 2003
Comment MSDC-RI MSDC-RI MSDC-RI MSDC-RI MSDC-RI
Column type CapillaryCapillaryCapillaryCapillaryCapillary
Active phase TC-WaxHP-FFAPHP-WaxDB-WaxHP-Wax
Column length (m) 60.25.60.30.60.
Carrier gas He HeHeHe
Substrate
Column diameter (mm) 0.250.320.250.530.25
Phase thickness (μm) 0.250.520.51.0.5
Tstart (C) 50.60.40.40.40.
Tend (C) 230.240.190.225.190.
Heat rate (K/min) 2.5.3.6.3.
Initial hold (min)  1.6.5.6.
Final hold (min)  5. 30.
I 1383.1341.1419.1380.1419.
ReferenceFukami, Ishiyama, et al., 2002Qian and Reineccius, 2002Sanz, Maeztu, et al., 2002Cadwallader and Heo, 2001Maeztu, Sanz, et al., 2001
Comment MSDC-RI MSDC-RI MSDC-RI MSDC-RI MSDC-RI
Column type CapillaryCapillaryCapillaryCapillaryCapillary
Active phase HP-WaxDB-WaxDB-WaxDB-WaxPEG-20M
Column length (m) 60.60.30.60.50.
Carrier gas He   He
Substrate
Column diameter (mm) 0.250.320.530.250.25
Phase thickness (μm) 0.5   0.15
Tstart (C) 40.30.60.30.60.
Tend (C) 190.170.210.170.180.
Heat rate (K/min) 3.2.4.2.2.
Initial hold (min) 6.4. 4.4.
Final hold (min)  60. 30.
I 1419.1385.1398.1385.1371.
ReferenceSanz, Ansorena, et al., 2001Buttery, Orts, et al., 1999Iwatsuki, Mizota, et al., 1999Buttery and Ling, 1998Togari, Kobayashi, et al., 1995
Comment MSDC-RI MSDC-RI MSDC-RI MSDC-RI MSDC-RI
Column type CapillaryCapillaryCapillaryCapillaryCapillary
Active phase DB-WaxCarbowax 20MCarbowax 20MDB-WaxCarbowax 20M
Column length (m) 60.50.50. 50.
Carrier gas HeHeHe30
Substrate
Column diameter (mm) 0.250.330.250.250.22
Phase thickness (μm)
Tstart (C) 40.60.60.30.80.
Tend (C) 200.200.180.240.200.
Heat rate (K/min) 2.3.2.50.2.
Initial hold (min) 2. 4.10.
Final hold (min)
I 1390.1356.1364.1367.1357.
ReferenceUmano, Hagi, et al., 1995Vernin, Metzger, et al., 1992Kawakami and Kobayashi, 1991Pfannhauser, 1990Mihara and Masuda, 1988
Comment MSDC-RI MSDC-RI MSDC-RI MSDC-RI MSDC-RI
Column type CapillaryCapillaryCapillaryCapillaryCapillary
Active phase FFAPFFAPDB-WaxCarbowax 20MCarbowax 20M
Column length (m) 50.50.30.50.50.
Carrier gas HeHeHeHydrogenN2
Substrate
Column diameter (mm) 0.280.280.250.200.22
Phase thickness (μm)
Tstart (C) 60.60.70.50.80.
Tend (C) 240.240.160.200.200.
Heat rate (K/min) 2.2.2.1.2.
Initial hold (min) 5.5.8.
Final hold (min)    35.
I 1375.1375.1386.1386.1357.
ReferenceVernin, Metzger, et al., 1988Vernin, Metzger, et al., 1988Wong and Bernhard, 1988Wu, Liou, et al., 1987Mihara and Enomoto, 1985
Comment MSDC-RI MSDC-RI MSDC-RI MSDC-RI MSDC-RI
Column type CapillaryCapillaryCapillaryCapillary
Active phase Carbowax 20MCarbowax 20MCarbowax 20MCarbowax 20M
Column length (m) 150.39.100.100.
Carrier gas HeH2
Substrate
Column diameter (mm) 0.640.300.250.25
Phase thickness (μm)
Tstart (C) 50.60.70.70.
Tend (C) 170.220.170.170.
Heat rate (K/min) 1.2.1.1.
Initial hold (min) 10.
Final hold (min) 60.
I 1390.1377.1396.1398.
ReferenceSeifert and King, 1982Liardon and Ledermann, 1980Shibamoto and Russell, 1977Shibamoto and Russell, 1977
Comment MSDC-RI MSDC-RI MSDC-RI MSDC-RI

Van Den Dool and Kratz RI, non-polar column, temperature ramp

Data compiled by: NIST Mass Spectrometry Data Center, William E. Wallace, director

Column type CapillaryCapillaryCapillaryCapillaryCapillary
Active phase SPB-5CP Sil 8 CBHP-5HP-5HP-5
Column length (m) 60.50.25.25.30.
Carrier gas He HeHe
Substrate
Column diameter (mm) 0.320.320.20.20.25
Phase thickness (μm) 1. 1.1.0.1
Tstart (C) 40.60.40.40.-30.
Tend (C) 230.220.280.280.250.
Heat rate (K/min) 3.4.5.5.10.
Initial hold (min) 5.5.  1.
Final hold (min) 5.30.5.5.5.
I 1002.995.1000.1000.997.
ReferenceDeport, Ratel, et al., 2006Mahadevan and Farmer, 2006Solina, Baumgartner, et al., 2005Solina, Baumgartner, et al., 2005Siegmund and Murkovic, 2004
Comment MSDC-RI MSDC-RI MSDC-RI MSDC-RI MSDC-RI
Column type CapillaryCapillaryCapillaryCapillaryCapillary
Active phase BPX-5BPX-5BPX-5BPX-5DB-1
Column length (m) 50.50.50.50.60.
Carrier gas  HeHeHeHe
Substrate
Column diameter (mm) 0.320.320.320.320.32
Phase thickness (μm) 0.50.50.250.251.
Tstart (C) 60.60.60.60.40.
Tend (C) 250.250.250.250.220.
Heat rate (K/min) 4.4.4.4.2.
Initial hold (min) 5.5.5.5.5.
Final hold (min) 20.10.10.10.
I 1021.1006.1015.1019.973.
ReferenceBredie, Mottram, et al., 2002Ames, Guy, et al., 2001Ames, Guy, et al., 2001, 2Ames, Guy, et al., 2001, 2Kim, 2001
Comment MSDC-RI MSDC-RI MSDC-RI MSDC-RI MSDC-RI
Column type CapillaryCapillaryCapillaryCapillaryCapillary
Active phase DB-1BPX-5BPX-5BP-5CP Sil 8 CB
Column length (m) 60.50.50.50.60.
Carrier gas HeHeHe He
Substrate
Column diameter (mm) 0.320.320.320.320.25
Phase thickness (μm) 1.0.250.25 0.25
Tstart (C) 40.35.35.60.40.
Tend (C) 220.250.250.250.280.
Heat rate (K/min) 2.4.4.4.4.
Initial hold (min) 5.3.3. 2.
Final hold (min)  10.10.
I 976.1012.1025.997.1008.
ReferenceKim, 2001Oruna-Concha, Duckham, et al., 2001Oruna-Concha, Duckham, et al., 2001Whitfield and Mottram, 2001Elmore, Mottram, et al., 2000
Comment MSDC-RI MSDC-RI MSDC-RI MSDC-RI MSDC-RI
Column type CapillaryCapillaryCapillaryCapillaryCapillary
Active phase DB-1BPX-5BPX-5BPX-5DB-1
Column length (m) 60.50.50.50.30.
Carrier gas N2HeHeHeHe
Substrate
Column diameter (mm) 0.250.3250.3250.3250.248
Phase thickness (μm) 1.0.50.50.50.25
Tstart (C) 30.20.20.50.50.
Tend (C) 200.250.250.250.250.
Heat rate (K/min) 5.4.4.4.5.
Initial hold (min)  2.2.2.5.
Final hold (min) 30.10.10.10.
I 988.1008.1011.1007.972.
ReferenceWu, Wang, et al., 2000Hill, Isaacs, et al., 1999Hill, Isaacs, et al., 1999Ames, Defaye, et al., 1997DeMilo, Lee, et al., 1996
Comment MSDC-RI MSDC-RI MSDC-RI MSDC-RI MSDC-RI
Column type CapillaryCapillaryCapillaryCapillaryCapillary
Active phase DB-1DB-1SPB-1DB-1DB-1
Column length (m) 30.30.30.60.60.
Carrier gas HeHeHe He
Substrate
Column diameter (mm) 0.2480.2480.250.250.25
Phase thickness (μm) 0.250.250.250.251.0
Tstart (C) 50.50.50.35.40.
Tend (C) 250.250.250.280.260.
Heat rate (K/min) 5.5.5.2.2.
Initial hold (min) 5.5.5.10.5.
Final hold (min)    10.60.
I 973.973.973.976.964.
ReferenceDeMilo, Lee, et al., 1996DeMilo, Lee, et al., 1996Lee, DeMilo, et al., 1995Specht and Baltes, 1994Yu, Lin, et al., 1994
Comment MSDC-RI MSDC-RI MSDC-RI MSDC-RI MSDC-RI
Column type CapillaryCapillaryCapillaryCapillaryCapillary
Active phase HP-1DB-1SE-30DB-1SPB-1
Column length (m) 50.50.50.60.60.
Carrier gas  He HeHe
Substrate
Column diameter (mm) 0.320.320.320.250.25
Phase thickness (μm) 1.51.050.250.250.25
Tstart (C) 40.40.50.40.35.
Tend (C) 220.260.240.220.235.
Heat rate (K/min) 2.2.4.2.2.
Initial hold (min)     10.
Final hold (min) 30.40. 10.40.
I 973.974.971.976.975.
ReferenceZhang, Dorjpalam, et al., 1992Izzo and Ho, 1991Misharina, Golovnya, et al., 1991Zhang and Ho, 1991Huang, Bruechert, et al., 1987
Comment MSDC-RI MSDC-RI MSDC-RI MSDC-RI MSDC-RI
Column type Capillary
Active phase SPB-1
Column length (m) 60.
Carrier gas He
Substrate
Column diameter (mm) 0.25
Phase thickness (μm) 0.25
Tstart (C) 35.
Tend (C) 235.
Heat rate (K/min) 2.
Initial hold (min) 10.
Final hold (min) 40.
I 975.
ReferenceHuang, Bruechert, et al., 1987
Comment MSDC-RI

Van Den Dool and Kratz RI, polar column, temperature ramp

Data compiled by: NIST Mass Spectrometry Data Center, William E. Wallace, director

Column type CapillaryCapillaryCapillaryCapillaryCapillary
Active phase DB-WaxDB-WaxCP-Wax 52CBOV-351PEG-20M
Column length (m) 30.30.50.50.60.
Carrier gas HeHe HeHe
Substrate
Column diameter (mm) 0.250.320.320.320.25
Phase thickness (μm) 0.50.5 0.20.25
Tstart (C) 40.40.60.60.50.
Tend (C) 250.240.220.220.230.
Heat rate (K/min) 4.5.4.5.2.
Initial hold (min) 5. 5.
Final hold (min) 15.10.30. 60.
I 1392.1402.1376.1363.1397.
ReferencePozo-Bayon M.A., Ruiz-Rodriguez A., et al., 2007Lopez-Galilea I., Fournier N., et al., 2006Mahadevan and Farmer, 2006Bonvehí, 2005Shimoda, Nakada, et al., 1997
Comment MSDC-RI MSDC-RI MSDC-RI MSDC-RI MSDC-RI
Column type CapillaryCapillaryCapillaryCapillaryCapillary
Active phase DB-WaxDB-WaxDB-WaxCP-WAX 57CBCP-WAX 57CB
Column length (m) 60.60.60.50.50.
Carrier gas HeHe  He
Substrate
Column diameter (mm) 0.250.250.250.320.32
Phase thickness (μm) 0.250.250.25
Tstart (C) 50.50.50.60.60.
Tend (C) 230.230.230.200.200.
Heat rate (K/min) 3.2.2.4.4.
Initial hold (min)    5.5.
Final hold (min)  60.  10.
I 1393.1397.1383.1394.1393.
ReferenceShimoda, Peralta, et al., 1996Shimoda, Shiratsuchi, et al., 1996Shimoda, Shigematsu, et al., 1995Salter L.J., Mottram D.S., et al., 1988Whitfield, Mottram, et al., 1988
Comment MSDC-RI MSDC-RI MSDC-RI MSDC-RI MSDC-RI
Column type Capillary
Active phase CP-WAX 57CB
Column length (m) 50.
Carrier gas He
Substrate
Column diameter (mm) 0.32
Phase thickness (μm)
Tstart (C) 60.
Tend (C) 200.
Heat rate (K/min) 4.
Initial hold (min) 5.
Final hold (min) 10.
I 1394.
ReferenceWhitfield, Mottram, et al., 1988
Comment MSDC-RI

Normal alkane RI, non-polar column, temperature ramp

Data compiled by: NIST Mass Spectrometry Data Center, William E. Wallace, director

Column type CapillaryCapillaryCapillaryCapillaryCapillary
Active phase HP-5 MSUltra-1HP-5DB-5DB-5 MS
Column length (m) 30.50.50.60.30.
Carrier gas HeliumHeliumHeliumHe
Substrate
Column diameter (mm) 0.250.200.200.320.25
Phase thickness (μm) 0.250.330.33 0.25
Tstart (C) 70.50.50.60.40.
Tend (C) 290.280.280.250.200.
Heat rate (K/min) 5.2.10.4.8.
Initial hold (min)    5.3.
Final hold (min) 10.20.8.5 20.
I 1004.974.1001.1022.981.
ReferenceRadulovic, Blagojevic, et al., 2010Du, Clery, et al., 2008Du, Clery, et al., 2008Fadel, Mageed, et al., 2006Schirack, Drake, et al., 2006
Comment MSDC-RI MSDC-RI MSDC-RI MSDC-RI MSDC-RI
Column type CapillaryCapillaryCapillaryCapillaryCapillary
Active phase MDN-5DB-5MSDB-5MSHP-5DB-1
Column length (m) 60.30.50.50.60.
Carrier gas HeHeHe He
Substrate
Column diameter (mm) 0.250.530.250.320.32
Phase thickness (μm) 0.251.5 0.521.0
Tstart (C) 40.40.40.35.40.
Tend (C) 270.225.220.250.260.
Heat rate (K/min) 4.6.5.2.3.
Initial hold (min) 4.5.5.15.
Final hold (min) 5.30.5.45.
I 1006.995.1000.1000.981.
Referencevan Loon, Linssen, et al., 2005Cadwallader and Heo, 2001Welty, Marshall, et al., 2001Boylston and Viniyard, 1998Chen and Ho, 1998
Comment MSDC-RI MSDC-RI MSDC-RI MSDC-RI MSDC-RI
Column type CapillaryCapillaryCapillaryCapillaryCapillary
Active phase DB-1DB-1DB-1DB-1DB-1
Column length (m) 60.60.60.60.60.
Carrier gas  HeHeHeHe
Substrate
Column diameter (mm) 0.250.320.250.250.25
Phase thickness (μm)  1. 1.1.0
Tstart (C) 30.40.30.40.40.
Tend (C) 200.280.200.260.260.
Heat rate (K/min) 4.2.4.2.2.
Initial hold (min) 25.2.25.5.5.
Final hold (min) 20.40.20.60.60.
I 975.983.970.985.980.
ReferenceButtery, Ling, et al., 1997Lu, Yu, et al., 1997Buttery and Ling, 1995Yu and Ho, 1995Yu, Wu, et al., 1994
Comment MSDC-RI MSDC-RI MSDC-RI MSDC-RI MSDC-RI
Column type CapillaryCapillaryCapillaryCapillaryCapillary
Active phase DB-1DB-1DB-1DB-1DB-1
Column length (m) 60.60.60.60.60.
Carrier gas HeHeHe
Substrate
Column diameter (mm) 0.250.250.250.320.32
Phase thickness (μm) 1.01.1.0.250.25
Tstart (C) 40.40.40.50.50.
Tend (C) 260.260.260.250.250.
Heat rate (K/min) 2.2.2.4.4.
Initial hold (min) 5.5.5.
Final hold (min) 60.60.60.
I 961.990.980.973.974.
ReferenceYu, Wu, et al., 1994Yu, Wu, et al., 1994, 2Yu, Wu, et al., 1994, 2Flath, Matsumoto, et al., 1989Flath, Matsumoto, et al., 1989
Comment MSDC-RI MSDC-RI MSDC-RI MSDC-RI MSDC-RI
Column type CapillaryCapillaryCapillaryCapillaryCapillary
Active phase DB-1DB-1OV-101OV-101OV-1
Column length (m) 60.60.50.50.50.
Carrier gas    N2Hydrogen
Substrate
Column diameter (mm) 0.320.320.220.220.20
Phase thickness (μm) 0.250.25
Tstart (C) 50.50.80.80.50.
Tend (C) 250.250.200.200.200.
Heat rate (K/min) 4.4.2.2.1.
Initial hold (min)
Final hold (min)     35.
I 974.975.980.980.971.
ReferenceFlath, Matsumoto, et al., 1989Flath, Matsumoto, et al., 1989Mihara and Masuda, 1988Mihara and Masuda, 1987Wu, Liou, et al., 1987
Comment MSDC-RI MSDC-RI MSDC-RI MSDC-RI MSDC-RI
Column type CapillaryCapillary
Active phase OV-101OV-101
Column length (m) 50.50.
Carrier gas N2He
Substrate
Column diameter (mm) 0.220.31
Phase thickness (μm)
Tstart (C) 80.0.
Tend (C) 200.225.
Heat rate (K/min) 2.3.
Initial hold (min)  1.
Final hold (min)
I 980.972.
ReferenceMihara and Enomoto, 1985del Rosario, de Lumen, et al., 1984
Comment MSDC-RI MSDC-RI

Van Den Dool and Kratz RI, polar column, custom temperature program

Data compiled by: NIST Mass Spectrometry Data Center, William E. Wallace, director

Column type CapillaryCapillaryCapillaryCapillaryCapillary
Active phase Supelcowax-10Supelcowax-10CP-Wax 52CBDB-WaxSupelcowax-10
Column length (m) 30.30.60.30.60.
Carrier gas HeHeHe
Substrate
Column diameter (mm) 0.250.250.250.250.25
Phase thickness (μm) 0.250.250.250.250.25
Program 35C(8min) => 4C/min => 60C => 6C/min => 160C => 20C/min => 200C(1min)35C(8min) => 4C/min => 60C => 6C/min => 160C => 20C/min => 200C(1min)40C => 5C/min => 60C => 2.5C/min => 155C20C(30s) => fast => 60C => 4C/min => 220C (20min)40C => (6C/min) => 80C(6min) => (15C/min) => 200C(10min)
I 1406.1399.1386.1376.1385.
ReferenceBianchi, Careri, et al., 2007Bianchi, Careri, et al., 2007Alasalvar, Shahidi, et al., 2003Cantergiani, Brevard, et al., 2001Baek and Cadwallader, 1996
Comment MSDC-RI MSDC-RI MSDC-RI MSDC-RI MSDC-RI
Column type CapillaryCapillary
Active phase DB-WaxBP-20
Column length (m) 30.50.
Carrier gas HeHe
Substrate
Column diameter (mm) 0.320.32
Phase thickness (μm) 0.250.5
Program 35C(2min) => 6C/min => 150C => 30C/min => 240C(1min)5 0C (0.5 min) -> (1 min) 60 0C (5 min) 4 0C/min -> 200 0C
I 1380.1406.
ReferenceAmrani-Hemaimi, Cerny, et al., 1995Beal and Mottram, 1994
Comment MSDC-RI MSDC-RI

References

Puvipirom and Chaisei, 2012
Puvipirom, J.; Chaisei, S., Contribution of roasted grains and seeds in aroma of oleang (Thai coffee drink), Int. Food Res. J., 2012, 19, 2, 583-588. [all data]

Budryn, Nebesny, et al., 2011
Budryn, G.; Nebesny, E.; Kula, J.; Majda, T.; Krysiak, W., HS-SPME/GC/MS Profiles of convectively and microwave roasted Ivory Coast Robusta coffee brews, Czech. J. Food Sci., 2011, 29, 2, 151-160. [all data]

Moon and Shibamoto, 2009
Moon, J.-K.; Shibamoto, T., Role of roasting conditions in the profile of volatile flavor chemicals formed from coffee beans, J. Agric. Food Chem., 2009, 57, 13, 5823-5831, https://doi.org/10.1021/jf901136e . [all data]

Du, Clery, et al., 2008
Du, Z.; Clery, R.; Hammond, C.J., Volatile organic nitrogen-containing constituents in ambrette seed Abelmoschus moschatus Medik (Malvaceae), J. Agric. Food Chem., 2008, 56, 16, 7388-7392, https://doi.org/10.1021/jf800958d . [all data]

Marin, Pozrl, et al., 2008
Marin, K.; Pozrl, T.; Zlatic, E.; Plestenjak, A., A new aroma index to determine the aroma quality of roasted and ground coffee during storage, Food Technol. Biotechnol., 2008, 46, 4, 442-447. [all data]

Characterization of Pyrazines in Some Chinese Liquors and Their Approximate Concentrations, 2007
Characterization of Pyrazines in Some Chinese Liquors; Their Approximate Concentrations, W. Fan; Y. Xu; Y. Zhang, J. Agric. Food Chem., 2007, 55, 9956-9962. [all data]

Nebesny, Budryn, et al., 2007
Nebesny, E.; Budryn, G.; Kula, J.; Majda, T., The effect of roasting method on headspace composition of robusta coffee bean aroma, Eur. Food Res. Technol., 2007, 225, 1, 9-19, https://doi.org/10.1007/s00217-006-0375-0 . [all data]

Fujioka and Shibamoto, 2006
Fujioka, K.; Shibamoto, T., Quantitation of volatiles and nonvolatile acids in an extract from coffee beverages: correlation with antioxidant activity, J. Agric. Food Chem., 2006, 54, 16, 6054-6058, https://doi.org/10.1021/jf060460x . [all data]

Ishikawa, Ito, et al., 2004
Ishikawa, M.; Ito, O.; Ishizaki, S.; Kurobayashi, Y.; Fujita, A., Solid-phase aroma concentrate extraction (SPACE ): a new headspace technique for more sensitive analysis of volatiles, Flavour Fragr. J., 2004, 19, 3, 183-187, https://doi.org/10.1002/ffj.1322 . [all data]

Tanaka, Yamauchi, et al., 2003
Tanaka, T.; Yamauchi, T.; Katsumata, R.; Kiuchi, K., Comparison of volatile components in commercial Itohiki-Natto by solid phase microextraction and gas chromatography, Nippon Shokuhin Kagaku Kogaku Kaishi, 2003, 50, 6, 278-285, https://doi.org/10.3136/nskkk.50.278 . [all data]

Fukami, Ishiyama, et al., 2002
Fukami, K.; Ishiyama, S.; Yaguramaki, H.; Masuzawa, T.; Nabeta, Y.; Endo, K.; Shimoda, M., Identification of distinctive volatile compounds in fish sauce, J. Agric. Food Chem., 2002, 50, 19, 5412-5416, https://doi.org/10.1021/jf020405y . [all data]

Qian and Reineccius, 2002
Qian, M.; Reineccius, G., Identification of aroma compounds in Parmigiano-Reggiano cheese by gas chromatography/olfactometry, J. Dairy Sci., 2002, 85, 6, 1362-1369, https://doi.org/10.3168/jds.S0022-0302(02)74202-1 . [all data]

Sanz, Maeztu, et al., 2002
Sanz, C.; Maeztu, L.; Zapelena, M.J.; Bello, J.; Cid, C., Profiles of volatile compounds and sensory analysis of three blends of coffee: influence of different proportions of Arabica and Robusta and influence of roasting coffee with sugar, J. Sci. Food Agric., 2002, 82, 8, 840-847, https://doi.org/10.1002/jsfa.1110 . [all data]

Cadwallader and Heo, 2001
Cadwallader, K.R.; Heo, J., Aroma of roasted sesame oil: characterization by direct thermal desorption-gas chromatography-olfactometry and sample dilution analysis, Am. Chem. Soc. Symp. Ser., 2001, 782, 187-202. [all data]

Maeztu, Sanz, et al., 2001
Maeztu, L.; Sanz, C.; Andueza, S.; de Peña, M.P.; Bello, J.; Cid, C., Characterization of espresso coffee aroma by static headspace GC-MS and sensory flavor profile, J. Agric. Food Chem., 2001, 49, 11, 5437-5444, https://doi.org/10.1021/jf0107959 . [all data]

Sanz, Ansorena, et al., 2001
Sanz, C.; Ansorena, D.; Bello, J.; Cid, C., Optimizing headspace temperature and time sampling for identification of volatile compounds in ground roasted Arabica coffee, J. Agric. Food Chem., 2001, 49, 3, 1364-1369, https://doi.org/10.1021/jf001100r . [all data]

Buttery, Orts, et al., 1999
Buttery, R.G.; Orts, W.J.; Takeoka, G.R.; Nam, Y., Volatile flavor components of rice cakes, J. Agric. Food Chem., 1999, 47, 10, 4353-4356, https://doi.org/10.1021/jf990140w . [all data]

Iwatsuki, Mizota, et al., 1999
Iwatsuki, K.; Mizota, Y.; Kubota, T.; Nishimura, O.; Masuda, H.; Sotoyama, K.; Tomita, M., Aroma extract dilution analysis. Evluation of aroma of pasteurized and UHT processed milk by aroma extract dilution analysis, Nippon Shokuhin Kagaku Kogaku Kaishi, 1999, 46, 9, 587-597, https://doi.org/10.3136/nskkk.46.587 . [all data]

Buttery and Ling, 1998
Buttery, R.G.; Ling, L.C., Additional studies on flavor components of corn tortilla chips, J. Agric. Food Chem., 1998, 46, 7, 2764-2769, https://doi.org/10.1021/jf980125b . [all data]

Togari, Kobayashi, et al., 1995
Togari, N.; Kobayashi, A.; Aishima, T., Pattern recognition applied to gas chromatographic profiles of volatile components in three tea categories, Food Res. Int., 1995, 28, 5, 495-502, https://doi.org/10.1016/0963-9969(95)00029-1 . [all data]

Umano, Hagi, et al., 1995
Umano, K.; Hagi, Y.; Nakahara, K.; Shyoji, A.; Shibamoto, T., Volatile chemicals formed in the headspace of a heated D-glucose/L-cysteine Maillard model system, J. Agric. Food Chem., 1995, 43, 8, 2212-2218, https://doi.org/10.1021/jf00056a046 . [all data]

Vernin, Metzger, et al., 1992
Vernin, G.; Metzger, J.; Boniface, C.; Murello, M.-H.; Siouffi, A.; Larice, J.-L.; Parkanyi, C., Kinetics and thermal degradation of the fructose-methionine Amadori intermediates. GC-MS/SPECMA data bank identification of volatile aroma compounds, Carbohyd. Res., 1992, 230, 1, 15-29, https://doi.org/10.1016/S0008-6215(00)90510-X . [all data]

Kawakami and Kobayashi, 1991
Kawakami, M.; Kobayashi, A., Volatitle constituents of greem mate and roasted mate, J. Agric. Food Chem., 1991, 39, 7, 1275-1279, https://doi.org/10.1021/jf00007a016 . [all data]

Pfannhauser, 1990
Pfannhauser, W., Fluchtige Verbindungen aus extrudaten von triticale, Deutsche Lebensmittel-Rundschau, 1990, 86, 3, 69-72. [all data]

Mihara and Masuda, 1988
Mihara, S.; Masuda, H., Structure-odor relationships for disubstituted pyrazines, J. Agric. Food Chem., 1988, 36, 6, 1242-1247, https://doi.org/10.1021/jf00084a029 . [all data]

Vernin, Metzger, et al., 1988
Vernin, G.; Metzger, J.; Obretenov, T.; Suon, K.-N.; Fraisse, D., GC/MS (EI,PCI,SIM)-data bank analysis of volatile compounds arising from thermal degradation of glucose-valine amadori intermediates in Flavors and Fragrances: A World Perspective. Proceedings of the 10th International Congress of Essential Oils, Fragrances and Flavors, Lawrence,B.M.; Mookherjee,B.D.; Willis,B.J., ed(s)., Elsevier, New York, 1988, 999-1028. [all data]

Wong and Bernhard, 1988
Wong, J.M.; Bernhard, R.A., Effect of nitrogen source on pyrazine formation, J. Agric. Food Chem., 1988, 36, 1, 123-129, https://doi.org/10.1021/jf00079a032 . [all data]

Wu, Liou, et al., 1987
Wu, C.-M.; Liou, S.-E.; Chang, Y.-H.; Chiang, W., Volatile compounds of the wax gourd (Benincasa hispida, Cogn) and a wax gourd beverage, J. Food Sci., 1987, 52, 1, 132-134, https://doi.org/10.1111/j.1365-2621.1987.tb13988.x . [all data]

Mihara and Enomoto, 1985
Mihara, S.; Enomoto, N., Calculation of retention indices of pyrazines on the basis of molecular structure, J. Chromatogr., 1985, 324, 428-430, https://doi.org/10.1016/S0021-9673(01)81342-X . [all data]

Seifert and King, 1982
Seifert, R.M.; King, A.D., Jr., Identification of some volatile constituents of Aspergillus clavatus, J. Agric. Food Chem., 1982, 30, 4, 786-790, https://doi.org/10.1021/jf00112a044 . [all data]

Liardon and Ledermann, 1980
Liardon, R.; Ledermann, S., volatile components of fermented soya hydrolysate. II. Composition of basic fraction, Z. Lebensm. Unters. Forsch., 1980, 170, 3, 208-213, https://doi.org/10.1007/BF01042542 . [all data]

Shibamoto and Russell, 1977
Shibamoto, T.; Russell, G.F., A study of the volatiles isolated from a D-glucose-hydrogen sulfide-ammonia model system, J. Agric. Food Chem., 1977, 25, 1, 109-112, https://doi.org/10.1021/jf60209a054 . [all data]