Hexenal

Normal alkane RI, non-polar column, custom temperature program

Data compiled by: NIST Mass Spectrometry Data Center, William E. Wallace, director

Column type CapillaryCapillary
Active phase RTX-5RTX-5
Column length (m)
Carrier gas
Substrate
Column diameter (mm)
Phase thickness (μm)
Program not specifiednot specified
I 800.800.
ReferenceMasanetz, Guth, et al., 1998Masanetz, Guth, et al., 1998
Comment MSDC-RI MSDC-RI

References

Masanetz, Guth, et al., 1998
Masanetz, C.; Guth, H.; Grosch, W., Fishy and hay-like off-flavours of dry spinach, Z. Lebensm. Unters. Forsch. A, 1998, 206, 2, 108-113, https://doi.org/10.1007/s002170050224 . [all data]