2H-Inden-2-one, octahydro-3a-methyl-, cis-

Gas phase thermochemistry data

Data compiled by: Hussein Y. Afeefy, Joel F. Liebman, and Stephen E. Stein

Quantity Value Units Method Reference Comment
Δfgas-287.0 ± 3.4kJ/molCcrSellers, 1970

Condensed phase thermochemistry data

Data compiled by: Hussein Y. Afeefy, Joel F. Liebman, and Stephen E. Stein

Quantity Value Units Method Reference Comment
Δfsolid-347.9 ± 3.4kJ/molCcrSellers, 1970
Quantity Value Units Method Reference Comment
Δcsolid-5873.8 ± 3.4kJ/molCcrSellers, 1970Corresponding Δfsolid = -347.91 kJ/mol (simple calculation by NIST; no Washburn corrections)

Phase change data

Data compiled as indicated in comments:
AC - William E. Acree, Jr., James S. Chickos
ALS - Hussein Y. Afeefy, Joel F. Liebman, and Stephen E. Stein

Quantity Value Units Method Reference Comment
Δsub60.9 ± 0.2kJ/molCSellers, Gram, et al., 1970See also Pedley and Rylance, 1977.; AC
Δsub60.92 ± 0.17kJ/molCSellers, 1970ALS

References

Sellers, 1970
Sellers, P., Enthalpies of formation of cis- and trans-8-Methyl-2-hydrindanome, Acta Chem. Scand., 1970, 24, 2453-2358. [all data]

Sellers, Gram, et al., 1970
Sellers, Peter; Gram, F.; Groth, P.; Klewe, B.; Rømming, Chr., Enthalpies of Formation of cis- and trans-8-Methyl-2-hydrindanone., Acta Chem. Scand., 1970, 24, 2453-2458, https://doi.org/10.3891/acta.chem.scand.24-2453 . [all data]

Pedley and Rylance, 1977
Pedley, J.B.; Rylance, J., , Computer Analysed Thermochemical Data: Organic and Organometallic Compounds, University of Sussex, Brighton, 1977. [all data]