Butane, 1,4-diethoxy-

Normal alkane RI, non-polar column, custom temperature program

Data compiled by: NIST Mass Spectrometry Data Center, William E. Wallace, director

Column type PackedPacked
Active phase Apiezon LSqualane
Column length (m)
Carrier gas
Substrate
Column diameter (mm)
Phase thickness (μm)
Program not specifiednot specified
I 936.6942.6
ReferenceKeiko, Prokop'ev, et al., 1972Keiko, Prokop'ev, et al., 1972
Comment MSDC-RI MSDC-RI

Reaction thermochemistry data

Data compiled by: Hussein Y. Afeefy, Joel F. Liebman, and Stephen E. Stein

Individual Reactions

2Hydrogen + 1,4-Bis-(vinyloxy)-butane = Butane, 1,4-diethoxy-

By formula: 2H2 + C8H14O2 = C8H18O2

Quantity Value Units Method Reference Comment
Δr-222.0 ± 1.3kJ/molChydAllinger, Glaser, et al., 1981liquid phase; solvent: Hexane

References

Keiko, Prokop'ev, et al., 1972
Keiko, V.V.; Prokop'ev, B.V.; Kuz'menko, L.P.; Kalinina, N.A.; Modonov, V.B., The use of an additive scheme of calculation of the indices of retention in gas-liquid chromatography communication. 3. Some regularities in the manifestation of the inductive effect, Izv. Akad. Nauk Kaz. SSR Ser. Khim., 1972, 12, 2629-2633. [all data]