beryllium hydroxide

Vibrational and/or electronic energy levels

Data compiled by: Marilyn E. Jacox

State:   X

Vib.
sym.
 No.   Approximate
 type of mode
 cm-1   Med.   Method   References

OH stretch 3805.9 Ar IR Thompson and Andrews, 1996
OBeO a-stretch 1493.7 Ar IR Thompson and Andrews, 1996
Deformation 456 Ar IR Thompson and Andrews, 1996

Additional references: Jacox, 1998, page 281

Gas phase thermochemistry data

Quantity Value Units Method Reference Comment
Δfgas-161.70kcal/molReviewChase, 1998Data last reviewed in December, 1975
Quantity Value Units Method Reference Comment
gas,1 bar55.918cal/mol*KReviewChase, 1998Data last reviewed in December, 1975

Gas Phase Heat Capacity (Shomate Equation)

Cp° = A + B*t + C*t2 + D*t3 + E/t2
H° − H°298.15= A*t + B*t2/2 + C*t3/3 + D*t4/4 − E/t + F − H
S° = A*ln(t) + B*t + C*t2/2 + D*t3/3 − E/(2*t2) + G
    Cp = heat capacity (cal/mol*K)
    H° = standard enthalpy (kcal/mol)
    S° = standard entropy (cal/mol*K)
    t = temperature (K) / 1000.

View plot Requires a JavaScript / HTML 5 canvas capable browser.

View table.

Temperature (K) 298. - 1400.1400. - 6000.
A 15.0349023.05470
B 13.086801.817420
C -7.753892-0.328610
D 2.0035710.020866
E -0.280634-3.011760
F -167.6420-174.6640
G 68.9580175.87679
H -161.7000-161.7000
ReferenceChase, 1998Chase, 1998
Comment Data last reviewed in December, 1975 Data last reviewed in December, 1975

Condensed phase thermochemistry data

Quantity Value Units Method Reference Comment
Δfsolid-216.50kcal/molReviewChase, 1998β phase; Data last reviewed in December, 1975

Solid Phase Heat Capacity (Shomate Equation)

Cp° = A + B*t + C*t2 + D*t3 + E/t2
H° − H°298.15= A*t + B*t2/2 + C*t3/3 + D*t4/4 − E/t + F − H
S° = A*ln(t) + B*t + C*t2/2 + D*t3/3 − E/(2*t2) + G
    Cp = heat capacity (cal/mol*K)
    H° = standard enthalpy (kcal/mol)
    S° = standard entropy (cal/mol*K)
    t = temperature (K) / 1000.

View plot Requires a JavaScript / HTML 5 canvas capable browser.

View table.

Temperature (K) 298. - 1000.298. - 1000.
A 13.3494713.34947
B 35.1809335.18093
C -33.30521-33.30521
D 12.2579812.25798
E -0.490122-0.490122
F -223.4214-222.7216
G 16.2655117.06551
H -216.5000-215.8000
ReferenceChase, 1998Chase, 1998
Comment β phase; Data last reviewed in December, 1975 α phase; Data last reviewed in December, 1975

References

Thompson and Andrews, 1996
Thompson, C.A.; Andrews, L., Reactions of Laser Ablated Be Atoms with H, J. Phys. Chem., 1996, 100, 30, 12214, https://doi.org/10.1021/jp9606927 . [all data]

Jacox, 1998
Jacox, M.E., Vibrational and electronic energy levels of polyatomic transient molecules: supplement A, J. Phys. Chem. Ref. Data, 1998, 27, 2, 115-393, https://doi.org/10.1063/1.556017 . [all data]