molybdenum tetrachloride

Gas phase thermochemistry data

Quantity Value Units Method Reference Comment
Δfgas-384.93kJ/molReviewChase, 1998Data last reviewed in December, 1968
Quantity Value Units Method Reference Comment
gas,1 bar371.93J/mol*KReviewChase, 1998Data last reviewed in December, 1968

Gas Phase Heat Capacity (Shomate Equation)

Cp° = A + B*t + C*t2 + D*t3 + E/t2
H° − H°298.15= A*t + B*t2/2 + C*t3/3 + D*t4/4 − E/t + F − H
S° = A*ln(t) + B*t + C*t2/2 + D*t3/3 − E/(2*t2) + G
    Cp = heat capacity (J/mol*K)
    H° = standard enthalpy (kJ/mol)
    S° = standard entropy (J/mol*K)
    t = temperature (K) / 1000.

View plot Requires a JavaScript / HTML 5 canvas capable browser.

View table.

Temperature (K) 1500. - 6000.
A 107.8815
B -0.647897
C 0.629006
D -0.068403
E -0.866481
F -419.9732
G 497.7747
H -384.9284
ReferenceChase, 1998
Comment Data last reviewed in December, 1968

Condensed phase thermochemistry data

Quantity Value Units Method Reference Comment
Δfliquid-462.84kJ/molReviewChase, 1998Data last reviewed in December, 1968
Quantity Value Units Method Reference Comment
liquid,1 bar245.52J/mol*KReviewChase, 1998Data last reviewed in December, 1968
Quantity Value Units Method Reference Comment
Δfsolid-476.98kJ/molReviewChase, 1998Data last reviewed in December, 1968
Quantity Value Units Method Reference Comment
solid223.93J/mol*KReviewChase, 1998Data last reviewed in December, 1968

Liquid Phase Heat Capacity (Shomate Equation)

Cp° = A + B*t + C*t2 + D*t3 + E/t2
H° − H°298.15= A*t + B*t2/2 + C*t3/3 + D*t4/4 − E/t + F − H
S° = A*ln(t) + B*t + C*t2/2 + D*t3/3 − E/(2*t2) + G
    Cp = heat capacity (J/mol*K)
    H° = standard enthalpy (kJ/mol)
    S° = standard entropy (J/mol*K)
    t = temperature (K) / 1000.

View plot Requires a JavaScript / HTML 5 canvas capable browser.

View table.

Temperature (K) 590. - 1500.
A 146.4400
B 0.000000
C 0.000000
D 0.000000
E 0.000000
F -506.4983
G 422.7388
H -462.8383
ReferenceChase, 1998
Comment Data last reviewed in December, 1968

Solid Phase Heat Capacity (Shomate Equation)

Cp° = A + B*t + C*t2 + D*t3 + E/t2
H° − H°298.15= A*t + B*t2/2 + C*t3/3 + D*t4/4 − E/t + F − H
S° = A*ln(t) + B*t + C*t2/2 + D*t3/3 − E/(2*t2) + G
    Cp = heat capacity (J/mol*K)
    H° = standard enthalpy (kJ/mol)
    S° = standard entropy (J/mol*K)
    t = temperature (K) / 1000.

View plot Requires a JavaScript / HTML 5 canvas capable browser.

View table.

Temperature (K) 298. - 590.
A 103.1164
B 75.99776
C -5.689947
D -7.135394
E 0.414023
F -509.6112
G 328.7080
H -476.9760
ReferenceChase, 1998
Comment Data last reviewed in December, 1968

Gas phase ion energetics data

Data compiled as indicated in comments:
LBLHLM - Sharon G. Lias, John E. Bartmess, Joel F. Liebman, John L. Holmes, Rhoda D. Levin, and W. Gary Mallard

Ionization energy determinations

IE (eV) Method Reference Comment
10.5 ± 0.1EIMakarov, Verkhoturov, et al., 1983LBLHLM

Appearance energy determinations

Ion AE (eV) Other Products MethodReferenceComment
Cl2Mo+13.6 ± 0.3Cl2EIMakarov, Verkhoturov, et al., 1983LBLHLM
Cl3Mo+13.2 ± 0.3ClEIMakarov, Verkhoturov, et al., 1983LBLHLM

References

Chase, 1998
Chase, M.W., Jr., NIST-JANAF Themochemical Tables, Fourth Edition, J. Phys. Chem. Ref. Data, Monograph 9, 1998, 1-1951. [all data]