Benzoic acid, 2-amino-, 2-phenylethyl ester

Kovats' RI, non-polar column, temperature ramp

Data compiled by: NIST Mass Spectrometry Data Center, William E. Wallace, director

Column type CapillaryCapillary
Active phase BP-1BP-1
Column length (m) 25.25.
Carrier gas N2N2
Substrate
Column diameter (mm) 0.320.55
Phase thickness (μm) 0.250.25
Tstart (C) 60.60.
Tend (C) 220.220.
Heat rate (K/min) 5.5.
Initial hold (min)
Final hold (min) 13.15.
I 2080.2088.
ReferenceRaina, Verma, et al., 2006Raina, Srivastava, et al., 2001
Comment MSDC-RI MSDC-RI

References

Raina, Verma, et al., 2006
Raina, V.K.; Verma, S.C.; Dhawan, S.; Khan, M.; Ramesh, S.; Singh, S.C.; Yadav, A.; Srivastava, S.K., Essential oil composition of Murraya exotica from the plains of northern India, Flavour Fragr. J., 2006, 21, 1, 140-142, https://doi.org/10.1002/ffj.1547 . [all data]

Raina, Srivastava, et al., 2001
Raina, V.K.; Srivastava, S.K.; Aggarwal, K.K.; Ramesh, S.; Kumar, S., Essential oil composition of Cinnamomum zeylanicum Blume leaves from Little Andaman, India, Flavour Fragr. J., 2001, 16, 5, 374-376, https://doi.org/10.1002/ffj.1016 . [all data]