Captan

Kovats' RI, non-polar column, custom temperature program

Data compiled by: NIST Mass Spectrometry Data Center, William E. Wallace, director

Column type CapillaryPackedPacked
Active phase HP-5SE-30SE-30
Column length (m) 30.2.1.5
Carrier gas  N2He
Substrate  Chromosorb W HPChromosorb G HP (80-100 mesh)
Column diameter (mm) 0.32
Phase thickness (μm) 0.25
Program 50C(1min) => 20C/min => 150C => 10C/min => 280C(4min)not specifiednot specified
I 2075.2030.2000.
ReferenceTanabe, Mitobe, et al., 2000Osselton and Snelling, 1986Ramsey, Lee, et al., 1980
Comment MSDC-RI MSDC-RI MSDC-RI

References

Tanabe, Mitobe, et al., 2000
Tanabe, A.; Mitobe, H.; Kawata, K.; Sakai, M.; Yasuhara, A., New monitoring system for ninety pesticides and related compounds in river water by solid-phase extraction with determination by gas chromatography/mass spectrometry, J. AOAC Int., 2000, 83, 1, 61-77. [all data]

Osselton and Snelling, 1986
Osselton, M.D.; Snelling, R.D., Chromatographic Identification of Pesticides, J. Chromatogr., 1986, 368, 265-271, https://doi.org/10.1016/S0021-9673(00)91068-9 . [all data]

Ramsey, Lee, et al., 1980
Ramsey, J.D.; Lee, T.D.; Osselton, M.D.; Moffat, A.C., Gas-liquid chromatographic retention indices of 296 non-drug substances on SE-30 or OV-1 likely to be encountered in toxicological analyses, J. Chromatogr., 1980, 184, 2, 185-206, https://doi.org/10.1016/S0021-9673(00)85641-1 . [all data]