2-Methyl-3-ethoxycarbonylquinoxaline, 1,4-dioxide

Phase change data

Data compiled by: William E. Acree, Jr., James S. Chickos

Quantity Value Units Method Reference Comment
Δsub133.4 ± 2.1kJ/molCRibeiro da Silva, Gomes, et al., 2004

References

Ribeiro da Silva, Gomes, et al., 2004
Ribeiro da Silva, Maria D.M.C.; Gomes, José R.B.; Gonçalves, Jorge M.; Sousa, Emanuel A.; Pandey, Siddharth; Acree, William E., Thermodynamic Properties of Quinoxaline-1,4-Dioxide Derivatives: A Combined Experimental and Computational Study, J. Org. Chem., 2004, 69, 8, 2785-2792, https://doi.org/10.1021/jo035695b . [all data]