2-Methyl-3-acetyl-quinoxaline 1,4-dioxide

Gas phase thermochemistry data

Data compiled by: Hussein Y. Afeefy, Joel F. Liebman, and Stephen E. Stein

Quantity Value Units Method Reference Comment
Δfgas33.1 ± 5.0kJ/molCcbAcree, Powell, et al., 1997

Condensed phase thermochemistry data

Data compiled by: Hussein Y. Afeefy, Joel F. Liebman, and Stephen E. Stein

Quantity Value Units Method Reference Comment
Δfsolid-83.9 ± 4.4kJ/molCcbAcree, Powell, et al., 1997
Quantity Value Units Method Reference Comment
Δcsolid-5673.9 ± 4.2kJ/molCcbAcree, Powell, et al., 1997

References

Acree, Powell, et al., 1997
Acree, W.E., Jr.; Powell, J.R.; Tucker, S.A.; Ribeiro da Silva, M.D.M.C.; Matos, M.A.R.; Goncalves, J.M.; Santos, L.M.N.B.F.; Morais, V.M.F.; Pilcher, G., Thermochemical and theroretical study of some quinoxaline 1,4-dioxides and pyrazine 1,4-dioxide, J. Org. Chem., 1997, 62, 3722-3726. [all data]