BrBS

Vibrational and/or electronic energy levels

Data compiled by: Marilyn E. Jacox

State:   X

Vib.
sym.
 No.   Approximate
 type of mode
 cm-1   Med.   Method   References

Π 2 Bend 270 ± 40 gas MW Cooper, Firth, et al., 1991
Σ+ 3 BBr stretch 414 ± 14 gas MW Cooper, Firth, et al., 1991

Additional references: Jacox, 1994, page 85

References

Cooper, Firth, et al., 1991
Cooper, T.A.; Firth, S.; Kroto, H.W., J. Chem. Soc., 1991, Faraday Trans. 87, 1499. [all data]

Jacox, 1994
Jacox, M.E., Vibrational and electronic energy levels of polyatomic transient molecules, American Chemical Society, Washington, DC, 1994, 464. [all data]