1,3-Naphthalenediol

Gas phase thermochemistry data

Data compiled by: Hussein Y. Afeefy, Joel F. Liebman, and Stephen E. Stein

Quantity Value Units Method Reference Comment
Δfgas-211.2 ± 1.9kJ/molCcbRibeiro Da Silva, Ribeiro Da Silva, et al., 1988

Condensed phase thermochemistry data

Data compiled by: Hussein Y. Afeefy, Joel F. Liebman, and Stephen E. Stein

Quantity Value Units Method Reference Comment
Δfsolid-327.2 ± 1.5kJ/molCcbRibeiro Da Silva, Ribeiro Da Silva, et al., 1988
Quantity Value Units Method Reference Comment
Δcsolid-4751.2 ± 0.7kJ/molCcbRibeiro Da Silva, Ribeiro Da Silva, et al., 1988Corresponding Δfsolid = -327.2 kJ/mol (simple calculation by NIST; no Washburn corrections)

Phase change data

Data compiled as indicated in comments:
ALS - Hussein Y. Afeefy, Joel F. Liebman, and Stephen E. Stein
DRB - Donald R. Burgess, Jr.
AC - William E. Acree, Jr., James S. Chickos

Quantity Value Units Method Reference Comment
Δsub116.0 ± 1.1kJ/molCRibeiro Da Silva, Ribeiro Da Silva, et al., 1988ALS
Δsub116.0kJ/molN/ARibeiro Da Silva, Ribeiro Da Silva, et al., 1988DRB
Δsub116.0 ± 1.1kJ/molCRibeiro Da Silva, Ribeiro Da Silva, et al., 1988AC

References

Ribeiro Da Silva, Ribeiro Da Silva, et al., 1988
Ribeiro Da Silva, M.A.V.; Ribeiro Da Silva, M.D.M.C.; Pilcher, G., Enthalpies of combustion of 1-hydroxynaphthalene, 2-hydroxynaphthalene, and 1,2-, 1,3-, 1,4-, and 2,3-dihydroxynaphthalenes, J. Chem. Thermodyn., 1988, 20, 969-974. [all data]