Diethylzinc diethyltellurim complex

Condensed phase thermochemistry data

Data compiled by: Eugene S. Domalski and Elizabeth D. Hearing

Quantity Value Units Method Reference Comment
liquid556.98J/mol*KN/ALebedev and Kulagina, 1991

Constant pressure heat capacity of liquid

Cp,liquid (J/mol*K) Temperature (K) Reference Comment
399.01298.15Lebedev and Kulagina, 1991T = 13 to 306 K.

Phase change data

Data compiled by: Eugene S. Domalski and Elizabeth D. Hearing

Enthalpy of phase transition

ΔHtrs (kcal/mol) Temperature (K) Initial Phase Final Phase Reference Comment
0.03951120.0crystaline, IIcrystaline, ILebedev and Kulagina, 1991T = 108 to 120 K.
3.9426187.90crystaline, IliquidLebedev and Kulagina, 1991

Entropy of phase transition

ΔStrs (cal/mol*K) Temperature (K) Initial Phase Final Phase Reference Comment
0.327120.0crystaline, IIcrystaline, ILebedev and Kulagina, 1991T
20.98187.90crystaline, IliquidLebedev and Kulagina, 1991

References

Lebedev and Kulagina, 1991
Lebedev, B.V.; Kulagina, T.G., Thermodynamics of the complex (C2H5)2ZnxTe(C2H5)2 in the temperature range from 0 to 300K, J. Chem. Thermodynam., 1991, 23(1), 1-9. [all data]