Tetracyclo[3.2.0.02,7.04,6]heptane-1,5-dicarbonitrile

Reaction thermochemistry data

Data compiled by: Hussein Y. Afeefy, Joel F. Liebman, and Stephen E. Stein

Individual Reactions

Bicyclo[2.2.1]hexa-2,5-diene, 2,3-dicarbonitrile- = Tetracyclo[3.2.0.02,7.04,6]heptane-1,5-dicarbonitrile

By formula: C9H6N2 = C9H6N2

Quantity Value Units Method Reference Comment
Δr93.3 ± 9.6kJ/molCisoHarel, Adamson, et al., 1987liquid phase; solvent: Acetonitrile; Photocalorimatry

References

Harel, Adamson, et al., 1987
Harel, Y.; Adamson, A.W.; Kutal, C.; Grutsch, P.A.; Yasufuku, K., Photocalorimetry. 6. Enthalpies of isomerization of norbornadiene and of substituted norbornadienes to corresponding quadricyclenes, J. Phys. Chem., 1987, 91, 901-904. [all data]