diarsenic trioxide

Phase change data

Antoine Equation Parameters

log10(P) = A − (B / (T + C))
    P = vapor pressure (atm)
    T = temperature (K)

View plot Requires a JavaScript / HTML 5 canvas capable browser.

Temperature (K) A B C Reference Comment
369.29 - 421.694.228532406.912-146.969Behrens and Rosenblatt, 1972Coefficents calculated by NIST from author's data.
485.7 - 730.42.15227925.481-302.329Stull, 1947Coefficents calculated by NIST from author's data.

Gas phase ion energetics data

Data compiled by: Sharon G. Lias, John E. Bartmess, Joel F. Liebman, John L. Holmes, Rhoda D. Levin, and W. Gary Mallard

Ionization energy determinations

IE (eV) Method Reference
10.4 ± 0.3EIBrittain, Lau, et al., 1982

Appearance energy determinations

Ion AE (eV) Other Products MethodReferenceComment
As2O2+14.5 ± 0.5OEIBrittain, Lau, et al., 1982

References

Behrens and Rosenblatt, 1972
Behrens, R.G.; Rosenblatt, G.M., Vapor Pressure and Thermodynamics of Octahedral Arsenic Trioxide (Arsenolite), J. Chem. Thermodyn., 1972, 4, 2, 175-190, https://doi.org/10.1016/0021-9614(72)90055-9 . [all data]

Stull, 1947
Stull, Daniel R., Vapor Pressure of Pure Substances. Organic and Inorganic Compounds, Ind. Eng. Chem., 1947, 39, 4, 517-540, https://doi.org/10.1021/ie50448a022 . [all data]

Brittain, Lau, et al., 1982
Brittain, R.D.; Lau, K.H.; Hildenbrand, D.L., Molecular species in the As-O system, J. Phys. Chem., 1982, 86, 5072. [all data]