(Methylcyclopentadienyl)(1,5-cyclooctadiene)iridium (I)

Phase change data

Data compiled by: William E. Acree, Jr., James S. Chickos

Enthalpy of vaporization

ΔvapH (kJ/mol) Temperature (K) Method Reference
88.1 ± 1.3310. - 330.MEMorozova, Semyannikov, et al., 2009

Enthalpy of sublimation

ΔsubH (kJ/mol) Temperature (K) Method Reference
124.6 ± 5.0304. - 310.MEMorozova, Semyannikov, et al., 2009

References

Morozova, Semyannikov, et al., 2009
Morozova, N.B.; Semyannikov, P.P.; Trubin, S.V.; Stabnikov, P.P.; Bessonov, A.A.; Zherikova, K.V.; Igumenov, I.K., Vapor pressure of some volatile iridium(I) compounds with carbonyl, acetylacetonate and cyclopentadienyl ligands, J Therm Anal Calorim, 2009, 96, 1, 261-266, https://doi.org/10.1007/s10973-008-9551-8 . [all data]