Sulfide, bis(4-methylbenzyl)-

Gas phase ion energetics data

Data compiled by: Sharon G. Lias and Joel F. Liebman

Ionization energy determinations

IE (eV) Method Reference Comment
8.0PETraven, Rodin, et al., 1989
8.13PETraven, Rodin, et al., 1989Vertical value

References

Traven, Rodin, et al., 1989
Traven, V.F.; Rodin, O.G.; Redchenko, V.V.; Rokitskaya, V.I., Electronic structure of n systems. IV. Steric and electronic structure of some benzyl chalcogenides, J. Gen. Chem. USSR, 1989, 59, 391. [all data]