1-chloro-2,2,3,3,4,4-hexafluorocyclobutane

Phase change data

Data compiled by: Thermodynamics Research Center, NIST Boulder Laboratories, Chris Muzny director

Quantity Value Units Method Reference Comment
Tboil311.3KN/AHwang, DesMarteau, et al., 1992Uncertainty assigned by TRC = 0.5 K

In addition to the Thermodynamics Research Center (TRC) data available from this site, much more physical and chemical property data is available from the following TRC products:

References

Hwang, DesMarteau, et al., 1992
Hwang, S.H.; DesMarteau, D.D.; Beyerlein, A.L.; Smith, N.D.; Joyner, P., The heat capacity of fluorinated propane and butane derivatives by differential scanning calorimetry, J. Therm. Anal., 1992, 38, 2515-28. [all data]