Benzenebutanamine

Gas phase ion energetics data

Data compiled by: Michael M. Meot-Ner (Mautner)

Gas basicity at 298K

Gas basicity (review) (kJ/mol) Reference Comment
925. ± 12.Cardoso, Alexandre, et al., 1998piperidine; dipropylamine

Phase change data

Data compiled by: Robert L. Brown and Stephen E. Stein

Reduced pressure boiling point

Tboil (K) Pressure (bar) Reference
396.70.023Weast and Grasselli, 1989

Van Den Dool and Kratz RI, non-polar column, temperature ramp

View large format table.

Column type Active phase I Reference Comment
CapillaryOV-11285.1Gautzsch and Zinn, 19968. K/min; Tstart: 35. C; Tend: 300. C

References

Cardoso, Alexandre, et al., 1998
Cardoso, A.M.; Alexandre, S.M.G.; Barros, C.M.F.; Ferrer-Correia, A.J.; Nibbering, N.M.M., Proton Affinities of Phenylalkylamines by the Kinetic Method, Int. J. Mass Spectrom. Ion. Processes, 1998, 172, 123. [all data]